program: Orca
programVersion: 4.2.1
elementType: Cl Cl O N N N C C C C C C C C C C C C C C H H H H H H H H H H H H H H H H H
charge: 0
multiplicity: 1
keywords: wb97x-d3
keywords: def2-TZVPP
keywords: def2/J RIJCOSX GRIDX6 NOFINALGRIDX
keywords: grid4 nofinalgrid
keywords: scfconv7
keywords: smallprint printgap noloewdin
keywords: NOSOSCF
formula: C14H17Cl2N3O
InChI: InChI=1S/C14H17Cl2N3O/c1-2-3-6-14(20,8-19-10-17-9-18-19)12-5-4-11(15)7-13(12)16/h4-5,7,9-10,20H,2-3,6,8H2,1H3
37 atoms
Cl -0.611045 0.479272 -2.398026
Cl -1.295721 5.057121 0.202462
O  0.376602 -1.069732 1.814297
N  -0.939599 -3.080953 0.100518
N  -0.421545 -3.690707 1.172079
N  -0.719849 -5.164465 -0.482074
C  0.077336 -0.846156 0.459913
C  1.2742 -1.259186 -0.423843
C  -1.190389 -1.657944 0.10125
C  2.45684 -0.294588 -0.455914
C  -0.274917 0.63674 0.334596
C  3.192799 -0.089691 0.863427
C  -0.589478 1.289854 -0.859033
C  -0.302334 1.42333 1.48633
C  4.436938 0.769833 0.689268
C  -0.903913 2.640103 -0.90755
C  -0.608938 2.772112 1.466099
C  -1.105628 -3.976525 -0.878441
C  -0.909931 3.377926 0.260698
C  -0.30544 -4.937527 0.776538
H  0.943015 -1.429557 -1.448777
H  1.624256 -2.232428 -0.06537
H  -1.566779 -1.402917 -0.886454
H  -1.971371 -1.431971 0.829894
H  3.167595 -0.68547 -1.191111
H  2.140682 0.676306 -0.849072
H  3.472205 -1.062235 1.278886
H  2.535101 0.371608 1.600298
H  0.370415 -2.026956 1.968768
H  -0.069678 0.96125 2.432844
H  4.183022 1.760515 0.308572
H  4.961983 0.908105 1.634666
H  5.139506 0.319767 -0.014467
H  -1.139191 3.106526 -1.853396
H  -0.612893 3.342788 2.383916
H  -1.50909 -3.72241 -1.846579
H  0.089821 -5.705573 1.422308
totalener: -1703.69178123 hartree
nucrepener: 1864.45850923 hartree
electener: -3568.15029047 hartree
oneelecener: -6040.56662890 hartree
twoeener: 2472.41633844 hartree
kineticenergy: 1698.96150861 hartree
xcener: -118.930122871829 hartree
chargesum: 0.0000000
charge: -0.081543 -0.067157 -0.384643 0.113905 -0.355123 -0.329380 0.469606 -0.266996 -0.190028 -0.109446 0.046175 -0.075329 -0.107111 -0.181548 -0.260921 -0.099479 -0.131203 0.064399 0.077368 0.083673 0.093368 0.089697 0.110986 0.134147 0.076035 0.069094 0.054559 0.063611 0.196483 0.145756 0.075105 0.084863 0.070718 0.114347 0.125579 0.142783 0.137652
qa: -0.0815 -0.0672 -0.3846 0.1139 -0.3551 -0.3294 0.4696 -0.2670 -0.1900 -0.1094 0.0462 -0.0753 -0.1071 -0.1815 -0.2609 -0.0995 -0.1312 0.0644 0.0774 0.0837 0.0934 0.0897 0.1110 0.1341 0.0760 0.0691 0.0546 0.0636 0.1965 0.1458 0.0751 0.0849 0.0707 0.1143 0.1256 0.1428 0.1377
va: 1.2419 1.2390 2.0329 3.3171 2.8619 3.0640 3.5721 3.9349 3.9140 3.8917 3.3956 3.8607 3.9983 4.0061 3.9449 4.0341 4.0173 4.0561 3.9539 4.0244 1.0263 1.0186 1.0291 1.0058 1.0096 1.0104 1.0134 1.0224 1.0936 1.0375 1.0027 1.0060 1.0040 1.0236 1.0123 1.0004 0.9994
dispcorr: -0.020844450 hartree
energy: -1703.712625681387
dipole: 23.21084 -23.40469 -0.19385 -15.33270 15.48788 0.15518 8.20324 -8.32733 -0.12409
magnitude: 0.27759 au
magnitude: 0.70558 debye
