program: Gaussian 09
title: 000030328
version: EM64L-G09RevD.01
frameworkgroup: C1[X(C13H20N2O2)]
method: RPBEPBE
basis: SDD
operation: Freq
keyword: #p
keyword: freq=noraman
keyword: PBEPBE/SDD
title: #p freq=noraman PBEPBE/SDD
converged: YES YES NO NO
title: Mulliken charges:
elementType: O O N N C C C C C C C C C C C C C H H H H H H H H H H H H H H H H H H H H
charge: -0.451028 -0.252388 -0.316137 -0.468346 -0.373741 -0.039443 0.163557 -0.473075 0.341729 0.365202 0.175984 -0.677556 -0.420665 -0.411769 -0.834946 -0.823731 -0.230828 0.214246 0.175693 0.180662 0.213189 0.216895 0.295403 0.302744 0.226260 0.217194 0.231130 0.233804 0.233457 0.220471 0.249624 0.238541 0.216130 0.220715 0.286269 0.226845 0.327907
chargesum: 0.00000
title: Mulliken charges with hydrogens summed into heavy atoms:
elementType: O O N N C C C C C C C C C C C C C
charge: -0.123121 -0.252388 -0.020734 -0.165601 0.016199 0.141220 0.163557 -0.042991 0.341729 0.365202 0.175984 -0.002972 -0.186861 -0.178312 -0.126310 -0.100617 -0.003983
polarizability: 2.17236599e+02 -5.76644217e+00 1.63237349e+02 1.40641692e+01 3.73330764e+00 1.11763085e+02
1716.lowfreq: -12.9650 -6.2598 -5.5861 0.0001 0.0003 0.0005 15.3508 29.7506 39.1501
frequency: 15.1665 29.7194 39.0607 72.6955 80.8813 89.5256 119.9303 142.6405 144.5109 166.6170 181.3617 191.9375 205.8339 224.9674 260.4482 289.1934 307.5633 319.8353 325.4727 342.8771 403.5499 439.1940 463.4653 475.5583 512.6092 514.8766 523.1063 538.3329 588.7004 598.4860 675.9835 679.5423 717.7541 755.9246 779.1371 833.8663 842.5382 898.3403 905.4618 911.0045 928.7916 947.3062 977.4010 984.6500 986.3490 1039.2542 1044.4631 1046.0967 1052.3181 1068.5166 1093.4115 1098.8361 1142.1627 1163.3328 1178.2204 1194.4866 1199.8269 1229.0598 1239.9716 1246.6771 1260.5043 1280.0738 1291.1204 1331.0557 1367.8343 1370.5520 1376.4373 1396.3409 1397.0837 1398.6252 1436.8942 1448.8697 1456.8779 1459.7211 1462.1196 1465.7225 1470.1888 1473.4059 1477.7420 1484.0307 1486.1971 1495.5876 1604.0165 1606.2673 1632.5597 2805.7030 2830.7225 2921.7415 2957.2591 2959.4410 2977.9287 2995.0066 3013.5204 3039.0596 3059.1927 3087.8270 3090.3896 3095.3441 3107.5204 3123.0376 3132.8403 3157.9845 3422.1052 3507.7571 3541.9861
redmass: 4.6817 2.8498 5.1062 4.4976 3.9129 4.1390 2.6783 2.2582 1.1232 2.6473 2.5909 1.4488 1.1754 2.6129 3.8004 3.5686 3.2062 1.8476 1.5426 2.8409 3.2660 2.7450 2.8600 3.5598 3.8847 3.1178 4.2520 3.7542 2.3947 1.6757 2.7571 1.8474 3.3484 4.4474 1.2229 4.1231 2.8404 1.3118 2.5938 1.9247 1.8342 2.7216 1.3506 1.9069 1.6266 1.7030 1.6570 2.3416 1.5972 1.9857 1.8073 1.7913 1.7745 2.6890 1.1641 2.4299 1.5959 1.3813 2.2396 1.3403 1.7219 2.3596 1.2185 1.3386 1.7056 2.2811 1.7298 1.5196 1.2415 1.2686 2.0565 1.6063 1.4251 1.1546 1.0515 1.0943 1.0827 1.0919 1.3801 1.0819 1.2776 1.5985 5.8480 6.6253 5.6000 1.0713 1.0710 1.0839 1.0839 1.0444 1.0365 1.0354 1.0872 1.0917 1.0970 1.0996 1.0980 1.0997 1.1003 1.0858 1.0920 1.0995 1.0740 1.0759 1.0657
irintensity: 0.6534 0.7313 0.4164 3.4287 3.6416 0.8634 2.2866 4.8923 0.0248 4.6419 1.5349 1.8551 8.2521 0.5102 11.4308 11.4844 7.8090 40.8156 112.6198 0.8273 20.1321 1.5111 2.0586 35.2851 2.4376 0.4340 5.0506 8.6673 15.9832 71.2616 33.4160 30.5934 39.7189 3.6862 55.2116 1.6624 3.0667 0.1199 9.9392 29.6134 10.2944 6.2586 0.1749 7.4348 2.3915 4.9763 5.6760 6.1059 10.8913 90.9928 1.1692 28.7000 19.1134 71.3662 2.1186 5.9894 4.8228 16.4309 118.4592 12.9734 7.3812 24.6955 3.7221 10.9908 10.8359 44.0817 2.3248 46.7317 38.4182 4.8063 34.3848 205.0073 31.0974 45.8964 8.8896 18.3787 15.5088 6.8259 76.9316 10.8901 20.8347 88.7906 7.9187 4.2567 118.5075 141.8644 105.5376 56.9823 39.7628 43.5996 24.4503 17.9850 39.9554 18.8518 11.6294 21.3238 20.2700 36.4266 20.7060 0.2591 24.6004 32.2449 25.6145 14.8677 5.0169
temp: 298.150 k
press: 1.00000 atm
elementType: 8 8 7 7 6 6 6 6 6 6 6 6 6 6 6 6 6 1 1 1 1 1 1 1 1 1 1 1 1 1 1 1 1 1 1 1 1
symmnumber: 1
zpe: 814806.4 jmol-1
zpe.correction: 0.310343 hartree
zpe.thermalcorrener: 0.329245 hartree
zpe.thermalcorrenthalpy: 0.330189 hartree
zpe.thermalcorrgfe: 0.261552 hartree
zpe.sumelectzpe: -766.026002 hartree
zpe.sumelectthermal: -766.007100 hartree
zpe.sumelectthermalent: -766.006156 hartree
zpe.sumelectthermalfe: -766.074793 hartree
dipole: -2.6041 0.0978 2.9482
dipole: 3.9349
quadrupole: -115.2727 -93.7472 -103.8090
quadrupole: -9.7522 1.8797 0.1054
quadrupole: -10.9964 10.5291 0.4673 -9.7522 1.8797 0.1054
hfenergy: -766.3363451 hartree
pointgroup: C01 [X(C13H20N2O2)]
dipole: -1.0285669 -0.0162211 -1.1568797 debye
polarizability: 216.8184164|7.5716849|163.1811836|-14.3275345|5.4017069|112.2374333 unknown
InChI: InChI=1S/C13H20N2O2/c1-9-5-4-6-10(2)13(9)15-12(17)8-14-7-11(3)16/h4-6,11,14-16H,7-8H2,1-3H3
charge 0 multiplicity 1
37 atoms
O  6.477278 0.696556 -0.087428
O  0.288451 1.008862 0.962365
N  2.741539 0.177761 -0.015385
N  -0.8176 -0.112628 -0.778248
C  4.060156 0.489618 -0.58209
C  5.184296 0.218662 0.446154
C  -2.171583 -0.067086 -0.285785
C  1.615983 0.244716 -0.948945
C  -2.865694 -1.307117 -0.153782
C  -2.800091 1.176683 0.010261
C  0.307648 0.410402 -0.15372
C  5.371526 -1.267155 0.751416
C  -4.205236 -1.287822 0.297706
C  -4.138847 1.146796 0.476231
C  -2.175842 -2.622467 -0.472874
C  -2.091752 2.50126 -0.180237
C  -4.839297 -0.068384 0.621572
H  4.237804 -0.148362 -1.469674
H  4.140631 1.555664 -0.931766
H  4.939858 0.767597 1.385476
H  1.679013 1.118861 -1.649996
H  1.57857 -0.664806 -1.585195
H  2.517603 0.696819 0.846909
H  -0.644683 -0.716639 -1.586434
H  6.124669 -1.409726 1.544927
H  5.719917 -1.792959 -0.155641
H  4.410422 -1.703373 1.072449
H  -4.745733 -2.234998 0.408149
H  -4.634927 2.095136 0.713173
H  -1.952593 -2.730489 -1.554311
H  -1.217274 -2.717692 0.070218
H  -2.814164 -3.476009 -0.190536
H  -1.535118 2.528175 -1.135769
H  -2.812866 3.336058 -0.175763
H  -1.351316 2.664749 0.62405
H  -5.874896 -0.065855 0.978849
H  6.401648 1.663593 -0.294927
