program: Orca
programVersion: 4.2.1
elementType: Cl Cl O N N N C C C C C C C C C C C C C C H H H H H H H H H H H H H H H H H
charge: 0
multiplicity: 1
keywords: wb97x-d3
keywords: def2-TZVPP
keywords: def2/J RIJCOSX GRIDX6 NOFINALGRIDX
keywords: grid4 nofinalgrid
keywords: scfconv7
keywords: smallprint printgap noloewdin
keywords: NOSOSCF
formula: C14H17Cl2N3O
InChI: InChI=1S/C14H17Cl2N3O/c1-2-3-6-14(20,8-19-10-17-9-18-19)12-5-4-11(15)7-13(12)16/h4-5,7,9-10,20H,2-3,6,8H2,1H3
37 atoms
Cl 0.124246 0.140986 -2.510679
Cl -2.676297 3.651897 0.32018
O  1.31761 -1.47456 1.66003
N  -0.807171 -2.56821 -0.097535
N  -1.140902 -2.819691 1.172849
N  -2.97426 -2.727661 -0.103601
C  1.123341 -1.089203 0.324603
C  2.509049 -0.732569 -0.22773
C  0.565605 -2.303774 -0.448769
C  3.196369 0.417677 0.497242
C  0.162432 0.108689 0.248972
C  4.59043 0.688919 -0.056074
C  -0.320692 0.69733 -0.920563
C  -0.265643 0.692013 1.440782
C  5.281835 1.850132 0.643113
C  -1.189774 1.778539 -0.908487
C  -1.128202 1.772047 1.485661
C  -1.91548 -2.50435 -0.84287
C  -1.59398 2.31055 0.300944
C  -2.450019 -2.90941 1.121044
H  2.4309 -0.494419 -1.290126
H  3.132475 -1.630174 -0.156022
H  1.172892 -3.175341 -0.196972
H  0.61265 -2.168695 -1.524815
H  2.592528 1.325731 0.407147
H  3.265118 0.196908 1.56482
H  4.524249 0.895767 -1.128655
H  5.202772 -0.212828 0.040091
H  0.536635 -1.97021 1.953792
H  0.103754 0.291553 2.372671
H  5.391437 1.659699 1.711815
H  6.277625 2.027526 0.236596
H  4.711826 2.773901 0.532303
H  -1.544352 2.198846 -1.838652
H  -1.432429 2.187652 2.435861
H  -1.901473 -2.294314 -1.901144
H  -3.042455 -3.115433 1.998453
totalener: -1703.69511923 hartree
nucrepener: 1889.34267381 hartree
electener: -3593.03779305 hartree
oneelecener: -6090.38662029 hartree
twoeener: 2497.34882724 hartree
kineticenergy: 1698.96810432 hartree
xcener: -118.930153563177 hartree
chargesum: -0.0000000
charge: -0.084656 -0.066777 -0.371433 0.136434 -0.354364 -0.327795 0.516525 -0.176219 -0.242022 -0.104508 -0.119646 -0.090279 -0.097042 -0.107898 -0.260893 -0.080005 -0.149706 0.063297 0.089289 0.082893 0.078901 0.083403 0.133417 0.125659 0.058714 0.080367 0.055290 0.056956 0.197266 0.128317 0.074966 0.084904 0.074346 0.112066 0.124253 0.140903 0.135080
qa: -0.0847 -0.0668 -0.3714 0.1364 -0.3544 -0.3278 0.5165 -0.1762 -0.2420 -0.1045 -0.1196 -0.0903 -0.0970 -0.1079 -0.2609 -0.0800 -0.1497 0.0633 0.0893 0.0829 0.0789 0.0834 0.1334 0.1257 0.0587 0.0804 0.0553 0.0570 0.1973 0.1283 0.0750 0.0849 0.0743 0.1121 0.1243 0.1409 0.1351
va: 1.2454 1.2388 2.0796 3.2918 2.8729 3.0665 3.6045 3.8141 3.9348 3.8601 3.5734 3.8893 3.9649 3.9217 3.9527 4.0216 4.0545 4.0507 3.9541 4.0331 1.0284 1.0279 1.0099 1.0146 1.0126 1.0251 1.0049 1.0076 1.0837 1.0423 1.0033 1.0058 1.0033 1.0236 1.0125 1.0096 0.9999
dispcorr: -0.020860975 hartree
energy: -1703.715980209477
dipole: 33.60587 -32.86747 0.73839 -6.78039 6.63872 -0.14166 7.87764 -8.20152 -0.32388
magnitude: 0.81865 au
magnitude: 2.08085 debye
