program: Orca
programVersion: 4.2.1
elementType: F F O N N N C C C C C C C C C C C C C C C C H H H H H H H H H H H H H
charge: 0
multiplicity: 1
keywords: wb97x-d3
keywords: def2-TZVPP
keywords: def2/J RIJCOSX GRIDX6 NOFINALGRIDX
keywords: grid4 nofinalgrid
keywords: scfconv7
keywords: smallprint printgap noloewdin
keywords: NOSOSCF
formula: C16H13F2N3O
InChI: InChI=1S/C16H13F2N3O/c17-13-7-5-12(6-8-13)16(22,9-21-11-19-10-20-21)14-3-1-2-4-15(14)18/h1-8,10-11,22H,9H2
35 atoms
F  0.87536 2.343824 1.395281
F  4.143402 -1.868873 -0.926285
O  -1.053802 0.250502 1.791911
N  -1.666162 -1.89666 -0.083309
N  -1.001793 -2.676218 -0.941904
N  -1.450461 -3.798203 0.948611
C  -0.838209 0.373488 0.405179
C  -1.871489 -0.494662 -0.348245
C  0.543058 -0.177142 0.096649
C  -0.948595 1.835435 -0.003918
C  1.111692 0.063373 -1.149414
C  1.215171 -0.999507 0.9920
C  -0.073682 2.766826 0.548049
C  -1.911352 2.326892 -0.880445
C  2.326635 -0.499725 -1.505436
C  2.431749 -1.5749 0.65224
C  -0.121976 4.112839 0.253671
C  -1.986469 3.678298 -1.193093
C  -1.91327 -2.574653 1.037621
C  2.96567 -1.314621 -0.592243
C  -1.09231 4.571337 -0.62658
C  -0.902195 -3.797909 -0.280336
H  -2.886778 -0.225605 -0.052533
H  -1.79254 -0.363466 -1.424748
H  0.605731 0.695596 -1.868982
H  0.802731 -1.21546 1.966941
H  -2.624537 1.65781 -1.341221
H  -1.916772 0.626794 2.001263
H  2.763621 -0.307348 -2.476161
H  2.952799 -2.214573 1.352261
H  0.589176 4.790733 0.706992
H  -2.74561 4.026493 -1.879727
H  -2.449015 -2.157881 1.874342
H  -1.14212 5.62482 -0.865737
H  -0.416562 -4.660994 -0.708092
elementType: F O N C H
totalener: -1056.79021040 hartree
nucrepener: 1825.29159683 hartree
electener: -2882.08180723 hartree
oneelecener: -5069.90503079 hartree
twoeener: 2187.82322356 hartree
cpcmener: -0.04056506 hartree
kineticenergy: 1052.65532459 hartree
xcener: -98.600712976751 hartree
chargesum: 0.0000000
charge: -0.216937 -0.227518 -0.389604 0.128659 -0.336362 -0.409214 0.692002 -0.199913 -0.039953 -0.278134 -0.181881 -0.193320 0.234130 -0.068373 -0.228112 -0.224674 -0.226801 -0.201751 0.056973 0.316349 -0.106912 0.047515 0.153045 0.126407 0.151864 0.146437 0.141947 0.222780 0.154776 0.152438 0.149308 0.162109 0.163793 0.167262 0.161664
qa: -0.2169 -0.2275 -0.3896 0.1287 -0.3364 -0.4092 0.6920 -0.1999 -0.0400 -0.2781 -0.1819 -0.1933 0.2341 -0.0684 -0.2281 -0.2247 -0.2268 -0.2018 0.0570 0.3163 -0.1069 0.0475 0.1530 0.1264 0.1519 0.1464 0.1419 0.2228 0.1548 0.1524 0.1493 0.1621 0.1638 0.1673 0.1617
va: 1.0707 1.0485 2.0452 3.3704 2.8819 3.0294 3.4324 3.9631 3.4571 3.6602 3.9014 3.9171 4.0106 3.7629 3.9324 3.9272 3.9673 3.9512 4.0781 3.8825 3.8415 4.0553 0.9918 1.0085 0.9936 1.0282 1.0120 1.0070 0.9966 0.9982 1.0034 0.9926 1.0117 0.9850 0.9965
dispcorr: -0.019559574 hartree
energy: -1056.809769974384
dipole: -12.42636 10.11491 -2.31145 5.34649 -2.75854 2.58795 -3.04581 2.50289 -0.54291
magnitude: 3.51213 au
magnitude: 8.92712 debye
