program: Orca
programVersion: 4.2.1
elementType: F F O N N N C C C C C C C C C C C C C C C C H H H H H H H H H H H H H
charge: 0
multiplicity: 1
keywords: wb97x-d3
keywords: def2-TZVPP
keywords: def2/J RIJCOSX GRIDX6 NOFINALGRIDX
keywords: grid4 nofinalgrid
keywords: scfconv7
keywords: smallprint printgap noloewdin
keywords: NOSOSCF
formula: C16H13F2N3O
InChI: InChI=1S/C16H13F2N3O/c17-13-7-5-12(6-8-13)16(22,9-21-11-19-10-20-21)14-3-1-2-4-15(14)18/h1-8,10-11,22H,9H2
35 atoms
F  0.290281 1.056144 -1.780046
F  5.57947 -0.174226 -0.181076
O  -0.216306 -1.036086 1.806518
N  -2.109317 -1.547558 -0.359839
N  -2.847421 -0.813118 -1.198743
N  -4.114243 -1.593555 0.480019
C  0.003628 -0.607929 0.480557
C  -0.676031 -1.604254 -0.484542
C  1.504414 -0.504077 0.237627
C  -0.665508 0.750065 0.347538
C  2.190008 -1.298448 -0.67253
C  2.231276 0.397143 1.014221
C  -0.498306 1.520194 -0.79447
C  -1.51639 1.25367 1.326213
C  3.567251 -1.195161 -0.820255
C  3.603493 0.5184 0.879157
C  -1.108322 2.743136 -0.97696
C  -2.150929 2.478133 1.166915
C  -2.874952 -1.991053 0.638789
C  4.249051 -0.285209 -0.041593
C  -1.945242 3.225804 0.018588
C  -4.03422 -0.874682 -0.655525
H  -0.438189 -1.397841 -1.524326
H  -0.342249 -2.619141 -0.265725
H  1.673099 -2.016035 -1.294284
H  1.724341 1.026936 1.734481
H  -1.694193 0.686817 2.22814
H  0.275572 -1.854259 1.945472
H  4.092951 -1.815505 -1.533626
H  4.160649 1.225139 1.479654
H  -0.934169 3.303938 -1.885838
H  -2.805693 2.844341 1.945918
H  -2.504537 -2.614561 1.435695
H  -2.433245 4.182374 -0.109465
H  -4.884214 -0.385726 -1.10488
elementType: F O N C H
totalener: -1056.79086316 hartree
nucrepener: 1824.02675447 hartree
electener: -2880.81761762 hartree
oneelecener: -5067.25795446 hartree
twoeener: 2186.44033683 hartree
cpcmener: -0.03694184 hartree
kineticenergy: 1052.64980605 hartree
xcener: -98.598944287939 hartree
chargesum: 0.0000000
charge: -0.224294 -0.224805 -0.387277 0.132163 -0.337942 -0.411105 0.687910 -0.202414 -0.120665 -0.205950 -0.117596 -0.264671 0.311689 -0.148196 -0.195417 -0.205475 -0.220064 -0.217728 0.055834 0.302918 -0.111023 0.051553 0.128703 0.151436 0.138258 0.147624 0.150914 0.223053 0.153714 0.154912 0.148784 0.161450 0.165414 0.166769 0.161524
qa: -0.2243 -0.2248 -0.3873 0.1322 -0.3379 -0.4111 0.6879 -0.2024 -0.1207 -0.2059 -0.1176 -0.2647 0.3117 -0.1482 -0.1954 -0.2055 -0.2201 -0.2177 0.0558 0.3029 -0.1110 0.0516 0.1287 0.1514 0.1383 0.1476 0.1509 0.2231 0.1537 0.1549 0.1488 0.1615 0.1654 0.1668 0.1615
va: 1.0617 1.0528 2.0363 3.3585 2.8840 3.0290 3.4104 3.9256 3.6136 3.5402 3.8346 4.0196 3.8454 3.8433 3.9056 3.9049 3.9778 3.9605 4.0787 3.8942 3.8458 4.0507 1.0179 0.9949 1.0110 1.0072 1.0291 1.0079 0.9986 0.9971 1.0024 0.9914 1.0114 0.9844 0.9963
dispcorr: -0.019660972 hartree
energy: -1056.810524127947
dipole: -9.32764 10.28897 0.96134 -0.31316 -0.37997 -0.69314 4.71430 -4.30222 0.41208
magnitude: 1.25476 au
magnitude: 3.18934 debye
