program: Orca
programVersion: 4.2.1
elementType: F F O N N N C C C C C C C C C C C C C C C C H H H H H H H H H H H H H
charge: 0
multiplicity: 1
keywords: wb97x-d3
keywords: def2-TZVPP
keywords: def2/J RIJCOSX GRIDX6 NOFINALGRIDX
keywords: grid4 nofinalgrid
keywords: scfconv7
keywords: smallprint printgap noloewdin
keywords: NOSOSCF
formula: C16H13F2N3O
InChI: InChI=1S/C16H13F2N3O/c17-13-7-5-12(6-8-13)16(22,9-21-11-19-10-20-21)14-3-1-2-4-15(14)18/h1-8,10-11,22H,9H2
35 atoms
F  -0.204219 1.737613 -1.87973
F  4.582728 -1.460956 -0.327485
O  -1.067713 -0.038039 1.869027
N  -1.746515 -1.822851 -0.354313
N  -1.706394 -2.487332 0.80393
N  -1.684152 -3.919839 -0.905842
C  -0.725898 0.255595 0.539773
C  -1.78502 -0.375436 -0.39043
C  0.698734 -0.229441 0.255543
C  -0.787653 1.777291 0.409692
C  1.114878 -0.720988 -0.977838
C  1.636056 -0.158771 1.285283
C  -0.515715 2.445043 -0.778583
C  -1.105617 2.578203 1.506101
C  2.422151 -1.141011 -1.182897
C  2.946677 -0.56741 1.098809
C  -0.551953 3.818955 -0.904688
C  -1.144167 3.961802 1.410373
C  -1.733562 -2.690851 -1.364884
C  3.31729 -1.056184 -0.138023
C  -0.868381 4.586398 0.204562
C  -1.665268 -3.740175 0.425812
H  -2.769516 -0.034733 -0.064488
H  -1.670049 -0.080729 -1.429766
H  0.436108 -0.794945 -1.815124
H  1.348317 0.218554 2.257165
H  -1.325251 2.117251 2.457268
H  -1.191949 -1.000624 1.937176
H  2.731677 -1.528138 -2.144753
H  3.664688 -0.508264 1.906305
H  -0.33354 4.275811 -1.861215
H  -1.392231 4.54892 2.28425
H  -1.761691 -2.388093 -2.400169
H  -0.898636 5.664454 0.120741
H  -1.621472 -4.548897 1.138307
elementType: F O N C H
totalener: -1056.79957436 hartree
nucrepener: 1807.67552575 hartree
electener: -2864.47510011 hartree
oneelecener: -5034.32936166 hartree
twoeener: 2169.85426154 hartree
cpcmener: -0.02507066 hartree
kineticenergy: 1052.61330251 hartree
xcener: -98.596947948443 hartree
chargesum: -0.0000000
charge: -0.227654 -0.223431 -0.417939 0.131919 -0.378123 -0.405175 0.609734 -0.196889 -0.022919 -0.168645 -0.182260 -0.211201 0.303336 -0.160644 -0.207748 -0.210105 -0.213904 -0.199292 0.066278 0.292948 -0.115231 0.094691 0.138241 0.135650 0.139693 0.140339 0.153527 0.218237 0.149989 0.150918 0.149117 0.157742 0.181858 0.161558 0.165384
qa: -0.2277 -0.2234 -0.4179 0.1319 -0.3781 -0.4052 0.6097 -0.1969 -0.0229 -0.1686 -0.1823 -0.2112 0.3033 -0.1606 -0.2077 -0.2101 -0.2139 -0.1993 0.0663 0.2929 -0.1152 0.0947 0.1382 0.1356 0.1397 0.1403 0.1535 0.2182 0.1500 0.1509 0.1491 0.1577 0.1819 0.1616 0.1654
va: 1.0584 1.0550 1.9987 3.3101 2.8741 3.0294 3.5025 3.9239 3.5189 3.6043 3.8805 3.9837 3.8686 3.8997 3.9637 3.9086 3.9818 3.9458 4.0428 3.9232 3.8679 4.0065 1.0085 1.0089 1.0094 1.0289 1.0317 1.0724 0.9995 0.9987 1.0034 0.9943 0.9895 0.9874 0.9918
dispcorr: -0.018468402 hartree
energy: -1056.818042765746
dipole: -8.73914 7.84809 -0.89105 5.25835 -3.85948 1.39887 4.28143 -4.77802 -0.49659
magnitude: 1.73130 au
magnitude: 4.40061 debye
