program: Orca
programVersion: 4.2.1
elementType: F F O N N N C C C C C C C C C C C C C C C C H H H H H H H H H H H H H
charge: 0
multiplicity: 1
keywords: wb97x-d3
keywords: def2-TZVPP
keywords: def2/J RIJCOSX GRIDX6 NOFINALGRIDX
keywords: grid4 nofinalgrid
keywords: scfconv7
keywords: smallprint printgap noloewdin
keywords: NOSOSCF
formula: C16H13F2N3O
InChI: InChI=1S/C16H13F2N3O/c17-13-7-5-12(6-8-13)16(22,9-21-11-19-10-20-21)14-3-1-2-4-15(14)18/h1-8,10-11,22H,9H2
35 atoms
F  0.755843 1.903167 1.991322
F  4.373308 -1.535777 -1.075722
O  -1.082006 -0.201517 1.628391
N  -1.732224 -1.825625 -0.594091
N  -2.525823 -2.468446 0.265464
N  -1.234181 -3.921858 -0.843326
C  -0.772781 0.252423 0.338416
C  -1.739109 -0.389276 -0.684376
C  0.638242 -0.208077 0.006502
C  -0.859058 1.773621 0.282407
C  1.264264 -1.218746 0.726292
C  1.298692 0.339437 -1.089867
C  -0.082403 2.530384 1.155619
C  -1.695217 2.478797 -0.578138
C  2.526831 -1.671076 0.366842
C  2.557476 -0.101814 -1.465325
C  -0.118508 3.908409 1.193854
C  -1.751435 3.866819 -0.562783
C  -0.96364 -2.70367 -1.244133
C  3.151924 -1.103626 -0.723584
C  -0.965888 4.581994 0.32543
C  -2.194481 -3.719669 0.08058
H  -2.76469 -0.061689 -0.509745
H  -1.472771 -0.10959 -1.702697
H  0.778386 -1.673942 1.577403
H  0.836304 1.128264 -1.671062
H  -2.321282 1.953338 -1.286037
H  -2.016101 -0.042202 1.805658
H  3.011539 -2.457022 0.93132
H  3.065625 0.33121 -2.316941
H  0.508983 4.444839 1.893912
H  -2.411912 4.382513 -1.246689
H  -0.243788 -2.414089 -1.994011
H  -1.004578 5.662899 0.346422
H  -2.667444 -4.520129 0.628338
elementType: F O N C H
totalener: -1056.79694803 hartree
nucrepener: 1811.48859997 hartree
electener: -2868.28554800 hartree
oneelecener: -5041.88360112 hartree
twoeener: 2173.59805312 hartree
cpcmener: -0.03261706 hartree
kineticenergy: 1052.62562081 hartree
xcener: -98.595385809871 hartree
chargesum: -0.0000000
charge: -0.212624 -0.223566 -0.371663 0.154692 -0.352457 -0.404041 0.689142 -0.220594 -0.080343 -0.263361 -0.175539 -0.173467 0.239839 -0.093833 -0.201220 -0.223674 -0.224367 -0.197138 0.043833 0.309216 -0.103715 0.057655 0.139059 0.142190 0.141294 0.150071 0.139264 0.210350 0.150964 0.151768 0.147538 0.158807 0.171860 0.162778 0.161283
qa: -0.2126 -0.2236 -0.3717 0.1547 -0.3525 -0.4040 0.6891 -0.2206 -0.0803 -0.2634 -0.1755 -0.1735 0.2398 -0.0938 -0.2012 -0.2237 -0.2244 -0.1971 0.0438 0.3092 -0.1037 0.0577 0.1391 0.1422 0.1413 0.1501 0.1393 0.2104 0.1510 0.1518 0.1475 0.1588 0.1719 0.1628 0.1613
va: 1.0772 1.0546 2.0638 3.3393 2.8890 3.0296 3.4499 3.9529 3.4775 3.6802 3.9148 3.8999 4.0155 3.7839 3.9151 3.9376 3.9672 3.9592 4.0807 3.9005 3.8488 4.0500 1.0062 0.9905 1.0331 0.9954 1.0130 1.0228 0.9983 0.9982 1.0039 0.9938 0.9930 0.9869 0.9948
dispcorr: -0.019060066 hartree
energy: -1056.816008092426
dipole: -11.08563 9.86903 -1.21660 5.86623 -3.41072 2.45550 -4.18917 3.08847 -1.10070
magnitude: 2.95316 au
magnitude: 7.50633 debye
