program: Orca
programVersion: 4.2.1
elementType: F F O N N N C C C C C C C C C C C C C C C C H H H H H H H H H H H H H
charge: 0
multiplicity: 1
keywords: wb97x-d3
keywords: def2-TZVPP
keywords: def2/J RIJCOSX GRIDX6 NOFINALGRIDX
keywords: grid4 nofinalgrid
keywords: scfconv7
keywords: smallprint printgap noloewdin
keywords: NOSOSCF
formula: C16H13F2N3O
InChI: InChI=1S/C16H13F2N3O/c17-13-7-5-12(6-8-13)16(22,9-21-11-19-10-20-21)14-3-1-2-4-15(14)18/h1-8,10-11,22H,9H2
35 atoms
F  -0.589405 1.02618 -1.899225
F  5.607468 -0.421825 -0.25567
O  -0.176253 -1.073316 1.787166
N  -1.969263 -1.495829 -0.567974
N  -2.653634 -1.732366 0.554771
N  -4.055459 -1.348347 -1.139742
C  0.025102 -0.500145 0.518424
C  -0.525874 -1.473494 -0.553471
C  1.534766 -0.421416 0.323541
C  -0.651987 0.872254 0.460765
C  2.307313 -1.5322 0.666113
C  2.178407 0.689315 -0.209665
C  -0.941758 1.558274 -0.711559
C  -1.009118 1.511696 1.647433
C  3.679003 -1.541753 0.473984
C  3.552295 0.69787 -0.409827
C  -1.565811 2.790006 -0.739579
C  -1.630972 2.750573 1.653636
C  -2.817511 -1.263664 -1.569279
C  4.27936 -0.42157 -0.066286
C  -1.916711 3.391279 0.457928
C  -3.900214 -1.633667 0.164944
H  -0.181464 -1.232148 -1.553585
H  -0.160341 -2.475684 -0.323207
H  1.845569 -2.412044 1.093523
H  1.631408 1.586788 -0.460674
H  -0.796167 1.03005 2.591003
H  -1.105048 -1.352456 1.847593
H  4.268956 -2.407879 0.74376
H  4.043449 1.569796 -0.821147
H  -1.767717 3.267877 -1.689419
H  -1.89247 3.212101 2.596415
H  -2.497028 -1.051877 -2.577008
H  -2.406717 4.355724 0.451402
H  -4.723739 -1.770946 0.848082
elementType: F O N C H
totalener: -1056.80013703 hartree
nucrepener: 1810.84990839 hartree
electener: -2867.65004541 hartree
oneelecener: -5040.55059346 hartree
twoeener: 2172.90054805 hartree
cpcmener: -0.02423861 hartree
kineticenergy: 1052.61003356 hartree
xcener: -98.594111736686 hartree
chargesum: 0.0000000
charge: -0.226274 -0.222606 -0.422718 0.133564 -0.380050 -0.407941 0.733985 -0.189046 -0.083271 -0.193634 -0.238326 -0.138460 0.198208 -0.154556 -0.210014 -0.207533 -0.194351 -0.206870 0.075789 0.300515 -0.115866 0.087806 0.131935 0.145794 0.141402 0.155072 0.146481 0.230003 0.151526 0.149930 0.148772 0.159311 0.173297 0.163059 0.165070
qa: -0.2263 -0.2226 -0.4227 0.1336 -0.3800 -0.4079 0.7340 -0.1890 -0.0833 -0.1936 -0.2383 -0.1385 0.1982 -0.1546 -0.2100 -0.2075 -0.1944 -0.2069 0.0758 0.3005 -0.1159 0.0878 0.1319 0.1458 0.1414 0.1551 0.1465 0.2300 0.1515 0.1499 0.1488 0.1593 0.1733 0.1631 0.1651
va: 1.0449 1.0565 2.0012 3.3189 2.8649 3.0296 3.3552 3.9123 3.6567 3.4774 4.0279 3.8638 3.8885 3.9129 3.9244 3.9337 3.9873 3.9516 4.0370 3.9094 3.8745 4.0145 1.0100 0.9954 1.0306 1.0020 1.0345 1.0481 0.9989 1.0007 1.0027 0.9936 0.9975 0.9873 0.9922
dispcorr: -0.018792720 hartree
energy: -1056.818929746010
dipole: -8.15363 8.09241 -0.06121 1.63396 -1.18454 0.44942 4.60798 -4.98750 -0.37952
magnitude: 0.59140 au
magnitude: 1.50322 debye
