program: Orca
programVersion: 4.2.1
elementType: F F O N N N C C C C C C C C C C C C C C C C H H H H H H H H H H H H H
charge: 0
multiplicity: 1
keywords: wb97x-d3
keywords: def2-TZVPP
keywords: def2/J RIJCOSX GRIDX6 NOFINALGRIDX
keywords: grid4 nofinalgrid
keywords: scfconv7
keywords: smallprint printgap noloewdin
keywords: NOSOSCF
formula: C16H13F2N3O
InChI: InChI=1S/C16H13F2N3O/c17-13-7-5-12(6-8-13)16(22,9-21-11-19-10-20-21)14-3-1-2-4-15(14)18/h1-8,10-11,22H,9H2
35 atoms
F  -0.817259 0.99834 -1.905048
F  5.620314 -0.362284 -0.182406
O  -0.210196 -1.10602 1.744496
N  -1.971507 -1.502198 -0.615938
N  -2.660983 -1.677235 0.515939
N  -4.056329 -1.352397 -1.19465
C  0.021668 -0.525949 0.486596
C  -0.526205 -1.485139 -0.597464
C  1.535648 -0.451132 0.310625
C  -0.623412 0.867387 0.453872
C  2.358823 -1.331204 1.010114
C  2.130662 0.447682 -0.571171
C  -1.020851 1.547338 -0.689289
C  -0.837142 1.533271 1.66232
C  3.736925 -1.307577 0.850121
C  3.505403 0.482046 -0.746704
C  -1.619965 2.792313 -0.667796
C  -1.426343 2.785727 1.717272
C  -2.817469 -1.306087 -1.627297
C  4.288132 -0.396843 -0.026289
C  -1.828333 3.416997 0.549669
C  -3.905936 -1.575452 0.12262
H  -0.177604 -1.238035 -1.594953
H  -0.158668 -2.487113 -0.368554
H  1.936102 -2.049551 1.697322
H  1.540956 1.152237 -1.139446
H  -0.538146 1.056247 2.58476
H  -1.151025 -1.346562 1.792119
H  4.36709 -1.990239 1.405118
H  3.95554 1.189098 -1.431165
H  -1.915772 3.259774 -1.598094
H  -1.575962 3.263721 2.67617
H  -2.495783 -1.147932 -2.6443
H  -2.298356 4.390808 0.581295
H  -4.730947 -1.668005 0.811524
elementType: F O N C H
totalener: -1056.79945136 hartree
nucrepener: 1810.23522226 hartree
electener: -2867.03467363 hartree
oneelecener: -5039.36972607 hartree
twoeener: 2172.33505245 hartree
cpcmener: -0.02320815 hartree
kineticenergy: 1052.60540432 hartree
xcener: -98.593711108785 hartree
chargesum: 0.0000000
charge: -0.231370 -0.222973 -0.421136 0.126894 -0.379020 -0.406533 0.604383 -0.168162 -0.021512 -0.119734 -0.218807 -0.194818 0.235246 -0.190141 -0.199511 -0.196855 -0.197647 -0.193792 0.075849 0.293766 -0.128870 0.090196 0.128534 0.138794 0.145193 0.163830 0.146732 0.229579 0.150903 0.150238 0.149500 0.159365 0.173511 0.163101 0.165269
qa: -0.2314 -0.2230 -0.4211 0.1269 -0.3790 -0.4065 0.6044 -0.1682 -0.0215 -0.1197 -0.2188 -0.1948 0.2352 -0.1901 -0.1995 -0.1969 -0.1976 -0.1938 0.0758 0.2938 -0.1289 0.0902 0.1285 0.1388 0.1452 0.1638 0.1467 0.2296 0.1509 0.1502 0.1495 0.1594 0.1735 0.1631 0.1653
va: 1.0376 1.0557 1.9951 3.3153 2.8668 3.0298 3.4998 3.9145 3.6321 3.4873 3.9935 3.9230 3.8489 3.9334 3.9096 3.9337 3.9789 3.9386 4.0395 3.9157 3.8801 4.0106 1.0076 1.0032 1.0346 0.9974 1.0336 1.0542 0.9995 1.0002 1.0016 0.9929 0.9981 0.9875 0.9921
dispcorr: -0.018721903 hartree
energy: -1056.818173267782
dipole: -7.49521 7.47354 -0.02167 1.63064 -1.20080 0.42985 4.56065 -4.93338 -0.37272
magnitude: 0.56935 au
magnitude: 1.44718 debye
