program: Orca
programVersion: 4.2.1
elementType: F F O N N N C C C C C C C C C C C C C C C C H H H H H H H H H H H H H
charge: 0
multiplicity: 1
keywords: wb97x-d3
keywords: def2-TZVPP
keywords: def2/J RIJCOSX GRIDX6 NOFINALGRIDX
keywords: grid4 nofinalgrid
keywords: scfconv7
keywords: smallprint printgap noloewdin
keywords: NOSOSCF
formula: C16H13F2N3O
InChI: InChI=1S/C16H13F2N3O/c17-13-7-5-12(6-8-13)16(22,9-21-11-19-10-20-21)14-3-1-2-4-15(14)18/h1-8,10-11,22H,9H2
35 atoms
F  0.927146 1.942893 1.821585
F  4.172767 -1.619644 -1.25553
O  -1.157198 -0.072074 1.789676
N  -1.696169 -1.811073 -0.531579
N  -1.810191 -2.546962 0.578587
N  -1.101776 -3.811473 -1.120577
C  -0.854725 0.269262 0.460453
C  -1.882791 -0.3826 -0.493254
C  0.532527 -0.211813 0.03465
C  -0.932421 1.786711 0.386801
C  1.269748 -1.089287 0.818551
C  1.054832 0.185336 -1.192965
C  -0.017714 2.557238 1.097163
C  -1.901639 2.476264 -0.335289
C  2.498167 -1.572185 0.388757
C  2.281626 -0.281787 -1.637603
C  -0.025491 3.936734 1.083345
C  -1.939722 3.863915 -0.36006
C  -1.261486 -2.575318 -1.532902
C  2.983014 -1.159633 -0.834502
C  -0.998958 4.594889 0.346034
C  -1.445043 -3.74007 0.176815
H  -2.900625 -0.16754 -0.164868
H  -1.767489 -0.020231 -1.51298
H  0.905868 -1.408451 1.785037
H  0.509581 0.876982 -1.824506
H  -2.652244 1.938555 -0.897675
H  -1.382351 -1.01631 1.827426
H  3.067042 -2.256447 1.00456
H  2.682288 0.034321 -2.591595
H  0.719007 4.485911 1.644755
H  -2.707549 4.366799 -0.932107
H  -1.086699 -2.193985 -2.526165
H  -1.016897 5.676209 0.328189
H  -1.430037 -4.585686 0.845862
elementType: F O N C H
totalener: -1056.79874995 hartree
nucrepener: 1824.48859100 hartree
electener: -2881.28734095 hartree
oneelecener: -5068.01955206 hartree
twoeener: 2186.73221111 hartree
cpcmener: -0.03063166 hartree
kineticenergy: 1052.62574029 hartree
xcener: -98.599014826444 hartree
chargesum: 0.0000000
charge: -0.213464 -0.224312 -0.417783 0.141890 -0.386492 -0.396946 0.728409 -0.221619 -0.112895 -0.212256 -0.149270 -0.226646 0.217823 -0.071686 -0.211774 -0.194125 -0.220343 -0.195053 0.074538 0.303312 -0.108017 0.080355 0.148013 0.125289 0.129829 0.142778 0.141173 0.222873 0.149584 0.152187 0.147351 0.157971 0.173892 0.162253 0.163165
qa: -0.2135 -0.2243 -0.4178 0.1419 -0.3865 -0.3969 0.7284 -0.2216 -0.1129 -0.2123 -0.1493 -0.2266 0.2178 -0.0717 -0.2118 -0.1941 -0.2203 -0.1951 0.0745 0.3033 -0.1080 0.0804 0.1480 0.1253 0.1298 0.1428 0.1412 0.2229 0.1496 0.1522 0.1474 0.1580 0.1739 0.1623 0.1632
va: 1.0793 1.0537 2.0366 3.3228 2.8577 3.0277 3.3088 3.9771 3.5387 3.6314 3.8894 3.9264 4.0190 3.7616 3.9280 3.9038 3.9679 3.9578 4.0418 3.9111 3.8572 4.0219 0.9995 0.9943 1.0354 1.0020 1.0100 1.0596 0.9989 0.9969 1.0037 0.9942 0.9937 0.9869 0.9939
dispcorr: -0.019244838 hartree
energy: -1056.817994783675
dipole: -11.35773 10.08585 -1.27188 5.01927 -3.53218 1.48709 -3.40621 2.10715 -1.29906
magnitude: 2.34876 au
magnitude: 5.97007 debye
