program: Orca
programVersion: 4.2.1
elementType: F F O N N N C C C C C C C C C C C C C C C C H H H H H H H H H H H H H
charge: 0
multiplicity: 1
keywords: wb97x-d3
keywords: def2-TZVPP
keywords: def2/J RIJCOSX GRIDX6 NOFINALGRIDX
keywords: grid4 nofinalgrid
keywords: scfconv7
keywords: smallprint printgap noloewdin
keywords: NOSOSCF
formula: C16H13F2N3O
InChI: InChI=1S/C16H13F2N3O/c17-13-7-5-12(6-8-13)16(22,9-21-11-19-10-20-21)14-3-1-2-4-15(14)18/h1-8,10-11,22H,9H2
35 atoms
F  -3.043362 1.897638 0.233872
F  4.594339 -1.740641 0.103322
O  -1.217214 0.151582 1.600861
N  -1.362614 -1.834094 -0.604885
N  -1.680282 -2.421289 0.552191
N  -0.896033 -3.932078 -0.891505
C  -0.646434 0.334513 0.329518
C  -1.484395 -0.400911 -0.748963
C  0.77715 -0.216599 0.274796
C  -0.678938 1.843344 0.083126
C  1.468517 -0.286829 -0.935104
C  1.412144 -0.671063 1.422974
C  -1.880257 2.548648 0.06705
C  0.478486 2.606671 -0.058024
C  2.754742 -0.794878 -1.003844
C  2.700739 -1.18877 1.374615
C  -1.953799 3.914536 -0.119311
C  0.436567 3.982408 -0.235129
C  -0.890277 -2.744382 -1.453552
C  3.349496 -1.242638 0.160102
C  -0.782325 4.638975 -0.273458
C  -1.382739 -3.678099 0.334974
H  -2.536926 -0.140472 -0.668157
H  -1.156684 -0.138625 -1.752756
H  1.018626 0.075221 -1.851732
H  0.913244 -0.626173 2.380773
H  1.445181 2.125424 -0.020855
H  -1.46428 -0.783731 1.693927
H  3.282617 -0.839901 -1.947434
H  3.185906 -1.543527 2.274568
H  -2.920147 4.401916 -0.134583
H  1.360547 4.535311 -0.337131
H  -0.566971 -2.505348 -2.45435
H  -0.828422 5.71034 -0.416155
H  -1.52611 -4.434688 1.090585
elementType: F O N C H
totalener: -1056.79786516 hartree
nucrepener: 1806.85553509 hartree
electener: -2863.65340025 hartree
oneelecener: -5032.55419649 hartree
twoeener: 2168.90079623 hartree
cpcmener: -0.02791476 hartree
kineticenergy: 1052.61204444 hartree
xcener: -98.596252666303 hartree
chargesum: 0.0000000
charge: -0.221179 -0.222700 -0.422368 0.138550 -0.378811 -0.406198 0.798118 -0.223204 -0.086287 -0.218180 -0.362631 -0.197970 0.251617 -0.073396 -0.145730 -0.193300 -0.241368 -0.218899 0.076140 0.287014 -0.101455 0.085838 0.156593 0.133314 0.150088 0.137630 0.162171 0.223523 0.153182 0.151309 0.148451 0.157708 0.176559 0.162457 0.163417
qa: -0.2212 -0.2227 -0.4224 0.1385 -0.3788 -0.4062 0.7981 -0.2232 -0.0863 -0.2182 -0.3626 -0.1980 0.2516 -0.0734 -0.1457 -0.1933 -0.2414 -0.2189 0.0761 0.2870 -0.1015 0.0858 0.1566 0.1333 0.1501 0.1376 0.1622 0.2235 0.1532 0.1513 0.1485 0.1577 0.1766 0.1625 0.1634
va: 1.0660 1.0565 2.0239 3.3205 2.8674 3.0296 3.2610 3.9138 3.4473 3.6396 3.9820 3.9543 4.0029 3.7545 3.8736 3.9038 3.9776 3.9861 4.0354 3.9386 3.8529 4.0158 1.0106 0.9938 1.0046 1.0384 0.9924 1.0590 0.9962 0.9996 1.0033 0.9946 0.9922 0.9868 0.9929
dispcorr: -0.018817776 hartree
energy: -1056.816682936563
dipole: -1.25576 1.32141 0.06565 5.27141 -3.86723 1.40418 -2.55476 1.23406 -1.32069
magnitude: 1.92880 au
magnitude: 4.90261 debye
