program: Orca
programVersion: 4.2.1
elementType: F F O N N N C C C C C C C C C C C C C C C C H H H H H H H H H H H H H
charge: 0
multiplicity: 1
keywords: wb97x-d3
keywords: def2-TZVPP
keywords: def2/J RIJCOSX GRIDX6 NOFINALGRIDX
keywords: grid4 nofinalgrid
keywords: scfconv7
keywords: smallprint printgap noloewdin
keywords: NOSOSCF
formula: C16H13F2N3O
InChI: InChI=1S/C16H13F2N3O/c17-13-7-5-12(6-8-13)16(22,9-21-11-19-10-20-21)14-3-1-2-4-15(14)18/h1-8,10-11,22H,9H2
35 atoms
F  0.152737 0.978242 -1.870981
F  5.569573 -0.145879 -0.142864
O  -0.151589 -1.104887 1.787158
N  -2.113499 -1.532852 -0.38692
N  -2.709368 -1.809683 0.776674
N  -4.212352 -1.101497 -0.71472
C  -0.006712 -0.61462 0.476228
C  -0.678304 -1.594648 -0.512487
C  1.494822 -0.507498 0.251052
C  -0.650952 0.76482 0.331408
C  2.192935 -1.298538 -0.651957
C  2.209372 0.40344 1.027146
C  -0.545908 1.496729 -0.84376
C  -1.378996 1.345316 1.364575
C  3.570038 -1.183591 -0.792423
C  3.582099 0.533041 0.903053
C  -1.124883 2.736066 -1.019119
C  -1.974577 2.590991 1.219398
C  -3.019965 -1.10104 -1.263061
C  4.239981 -0.26746 -0.010824
C  -1.850212 3.286697 0.027574
C  -3.967301 -1.535522 0.533945
H  -0.4375 -1.371084 -1.548113
H  -0.348975 -2.613763 -0.30556
H  1.686313 -2.023625 -1.27411
H  1.693352 1.035446 1.739279
H  -1.476594 0.824942 2.307109
H  -1.067907 -1.404334 1.910418
H  4.106198 -1.800242 -1.501801
H  4.129598 1.246626 1.504892
H  -1.008176 3.259715 -1.959271
H  -2.534899 3.014828 2.042074
H  -2.772153 -0.811829 -2.272771
H  -2.311793 4.257678 -0.093186
H  -4.733167 -1.659317 1.283754
elementType: F O N C H
totalener: -1056.80008886 hartree
nucrepener: 1820.29144266 hartree
electener: -2877.09153151 hartree
oneelecener: -5059.45387224 hartree
twoeener: 2182.36234073 hartree
cpcmener: -0.02718996 hartree
kineticenergy: 1052.62184230 hartree
xcener: -98.596974180131 hartree
chargesum: -0.0000000
charge: -0.223768 -0.222878 -0.410055 0.143245 -0.384388 -0.399152 0.714237 -0.239432 -0.064755 -0.264487 -0.109022 -0.261838 0.259629 -0.124214 -0.195918 -0.206054 -0.190898 -0.199084 0.073942 0.301917 -0.117368 0.082161 0.130820 0.149931 0.136238 0.149506 0.137763 0.222558 0.150138 0.151865 0.147874 0.158661 0.176390 0.163117 0.163320
qa: -0.2238 -0.2229 -0.4101 0.1432 -0.3844 -0.3992 0.7142 -0.2394 -0.0648 -0.2645 -0.1090 -0.2618 0.2596 -0.1242 -0.1959 -0.2061 -0.1909 -0.1991 0.0739 0.3019 -0.1174 0.0822 0.1308 0.1499 0.1362 0.1495 0.1378 0.2226 0.1501 0.1519 0.1479 0.1587 0.1764 0.1631 0.1633
va: 1.0604 1.0558 2.0360 3.3134 2.8616 3.0302 3.3183 3.9305 3.6080 3.6007 3.8212 4.0166 3.8739 3.8243 3.9148 3.9042 3.9555 3.9658 4.0422 3.9023 3.8716 4.0194 1.0053 1.0006 1.0092 1.0021 1.0346 1.0575 1.0002 0.9980 1.0024 0.9922 0.9913 0.9864 0.9934
dispcorr: -0.019241753 hartree
energy: -1056.819330608870
dipole: -10.10668 9.74606 -0.36062 1.07156 -0.75429 0.31726 3.60548 -4.25209 -0.64661
magnitude: 0.80549 au
magnitude: 2.04738 debye
