program: Orca
programVersion: 4.2.1
elementType: F F O N N N C C C C C C C C C C C C C C C C H H H H H H H H H H H H H
charge: 0
multiplicity: 1
keywords: wb97x-d3
keywords: def2-TZVPP
keywords: def2/J RIJCOSX GRIDX6 NOFINALGRIDX
keywords: grid4 nofinalgrid
keywords: scfconv7
keywords: smallprint printgap noloewdin
keywords: NOSOSCF
formula: C16H13F2N3O
InChI: InChI=1S/C16H13F2N3O/c17-13-7-5-12(6-8-13)16(22,9-21-11-19-10-20-21)14-3-1-2-4-15(14)18/h1-8,10-11,22H,9H2
35 atoms
F  -0.660069 0.897135 -1.997375
F  5.569138 -0.41793 -0.12191
O  -0.264854 -0.998351 1.802383
N  -1.996516 -1.556332 -0.544784
N  -2.683154 -1.763502 0.584221
N  -4.088321 -1.450911 -1.125053
C  -0.027824 -0.486567 0.518242
C  -0.554571 -1.510092 -0.5200
C  1.485105 -0.412591 0.355817
C  -0.697163 0.883058 0.371505
C  2.135038 0.666088 -0.230491
C  2.255799 -1.490259 0.791452
C  -0.989726 1.500491 -0.836991
C  -1.029794 1.598305 1.520286
C  3.512562 0.673262 -0.39536
C  3.630701 -1.502111 0.630712
C  -1.593755 2.73877 -0.931112
C  -1.630776 2.844865 1.458826
C  -2.853091 -1.365268 -1.554019
C  4.241198 -0.415842 0.033857
C  -1.919993 3.416911 0.230566
C  -3.932396 -1.690826 0.188667
H  -0.201573 -1.297071 -1.523475
H  -0.172536 -2.494593 -0.243318
H  1.582082 1.538702 -0.5471
H  1.782947 -2.330594 1.281259
H  -0.806532 1.16188 2.482928
H  -1.189967 -1.294438 1.836471
H  4.011507 1.520839 -0.845335
H  4.223346 -2.339778 0.973212
H  -1.798691 3.15842 -1.906828
H  -1.873953 3.366922 2.37408
H  -2.538708 -1.174001 -2.56786
H  -2.394786 4.386832 0.17091
H  -4.755263 -1.814427 0.874789
totalener: -1056.77715336 hartree
nucrepener: 1810.49396042 hartree
electener: -2867.27111378 hartree
oneelecener: -5039.41289157 hartree
twoeener: 2172.14177779 hartree
kineticenergy: 1052.61561164 hartree
xcener: -98.593706589122 hartree
chargesum: 0.0000000
charge: -0.221805 -0.202757 -0.375781 0.122563 -0.348043 -0.330546 0.713176 -0.221194 -0.095283 -0.215765 -0.107072 -0.203310 0.183358 -0.121506 -0.179115 -0.181932 -0.171930 -0.167933 0.057886 0.280763 -0.084109 0.087720 0.125903 0.134277 0.134310 0.125751 0.136334 0.207753 0.122914 0.125803 0.125958 0.129336 0.147010 0.131630 0.135634
qa: -0.2218 -0.2028 -0.3758 0.1226 -0.3480 -0.3305 0.7132 -0.2212 -0.0953 -0.2158 -0.1071 -0.2033 0.1834 -0.1215 -0.1791 -0.1819 -0.1719 -0.1679 0.0579 0.2808 -0.0841 0.0877 0.1259 0.1343 0.1343 0.1258 0.1363 0.2078 0.1229 0.1258 0.1260 0.1293 0.1470 0.1316 0.1356
va: 1.0502 1.0861 2.0474 3.3128 2.8785 3.0622 3.3838 3.9396 3.7535 3.5675 3.8851 4.0374 3.9162 3.9576 3.9414 3.9339 4.0298 3.9929 4.0564 3.9845 3.9262 4.0305 1.0122 0.9979 1.0087 1.0366 1.0378 1.0747 1.0091 1.0074 1.0098 1.0036 1.0046 0.9978 0.9997
dispcorr: -0.018762923 hartree
energy: -1056.795916285374
dipole: -8.01053 7.90993 -0.10060 1.95729 -1.55173 0.40557 4.35830 -4.54497 -0.18667
magnitude: 0.45766 au
magnitude: 1.16328 debye
