program: Orca
programVersion: 4.2.1
elementType: F F O N N N C C C C C C C C C C C C C C C C H H H H H H H H H H H H H
charge: 0
multiplicity: 1
keywords: wb97x-d3
keywords: def2-TZVPP
keywords: def2/J RIJCOSX GRIDX6 NOFINALGRIDX
keywords: grid4 nofinalgrid
keywords: scfconv7
keywords: smallprint printgap noloewdin
keywords: NOSOSCF
formula: C16H13F2N3O
InChI: InChI=1S/C16H13F2N3O/c17-13-7-5-12(6-8-13)16(22,9-21-11-19-10-20-21)14-3-1-2-4-15(14)18/h1-8,10-11,22H,9H2
35 atoms
F  -0.699122 1.021189 -1.913242
F  5.598106 -0.40603 -0.207982
O  -0.21533 -1.094955 1.754444
N  -1.970656 -1.509455 -0.604481
N  -2.646045 -1.779376 0.518109
N  -4.068094 -1.38329 -1.159394
C  0.009984 -0.50551 0.502014
C  -0.528568 -1.46379 -0.590836
C  1.521267 -0.424121 0.326101
C  -0.656107 0.872817 0.451299
C  2.301515 -1.504505 0.735893
C  2.158479 0.663722 -0.257996
C  -0.987071 1.557835 -0.709567
C  -0.944915 1.524209 1.649352
C  3.674443 -1.508182 0.556376
C  3.53325 0.678285 -0.442199
C  -1.588695 2.801016 -0.713309
C  -1.541507 2.773747 1.678574
C  -2.837393 -1.269512 -1.594539
C  4.272203 -0.41241 -0.034992
C  -1.871182 3.414123 0.494849
C  -3.899131 -1.689404 0.138898
H  -0.184624 -1.191966 -1.583467
H  -0.143189 -2.462205 -0.375215
H  1.837953 -2.353329 1.219311
H  1.597996 1.537294 -0.557876
H  -0.691175 1.033644 2.577783
H  -1.14222 -1.386209 1.780932
H  4.274787 -2.347628 0.880188
H  4.022694 1.532495 -0.889936
H  -1.826119 3.274606 -1.656447
H  -1.74989 3.2446 2.629524
H  -2.533468 -1.024266 -2.599877
H  -2.344193 4.386632 0.506379
H  -4.715543 -1.852863 0.82434
totalener: -1056.77714901 hartree
nucrepener: 1810.17594977 hartree
electener: -2866.95309878 hartree
oneelecener: -5038.78387919 hartree
twoeener: 2171.83078041 hartree
kineticenergy: 1052.61705818 hartree
xcener: -98.593908984729 hartree
chargesum: -0.0000000
charge: -0.222700 -0.202835 -0.376843 0.121971 -0.348140 -0.330788 0.691553 -0.217509 -0.087172 -0.202889 -0.200595 -0.116632 0.188383 -0.125083 -0.179803 -0.177143 -0.171167 -0.167410 0.058341 0.280160 -0.085346 0.087764 0.124804 0.134042 0.127161 0.135051 0.136313 0.208381 0.125715 0.122946 0.125746 0.129545 0.146591 0.131811 0.135775
qa: -0.2227 -0.2028 -0.3768 0.1220 -0.3481 -0.3308 0.6916 -0.2175 -0.0872 -0.2029 -0.2006 -0.1166 0.1884 -0.1251 -0.1798 -0.1771 -0.1712 -0.1674 0.0583 0.2802 -0.0853 0.0878 0.1248 0.1340 0.1272 0.1351 0.1363 0.2084 0.1257 0.1229 0.1257 0.1295 0.1466 0.1318 0.1358
va: 1.0492 1.0859 2.0435 3.3117 2.8787 3.0625 3.4098 3.9377 3.7531 3.5678 4.0328 3.8987 3.9102 3.9608 3.9311 3.9399 4.0325 3.9911 4.0570 3.9847 3.9272 4.0304 1.0117 0.9986 1.0374 1.0075 1.0373 1.0747 1.0075 1.0091 1.0098 1.0034 1.0050 0.9978 0.9997
dispcorr: -0.018745264 hartree
energy: -1056.795894270024
dipole: -7.81938 7.72585 -0.09353 1.72420 -1.30432 0.41988 4.59035 -4.74330 -0.15295
magnitude: 0.45656 au
magnitude: 1.16047 debye
