program: Orca
programVersion: 4.2.1
elementType: Si F F N N N C C C C C C C C C C C C C C C C H H H H H H H H H H H H H H H
charge: 0
multiplicity: 1
keywords: wb97x-d3
keywords: def2-TZVPP
keywords: def2/J RIJCOSX GRIDX6 NOFINALGRIDX
keywords: grid4 nofinalgrid
keywords: scfconv7
keywords: smallprint printgap noloewdin
keywords: NOSOSCF
formula: C16H15F2N3Si
InChI: InChI=1S/C16H15F2N3Si/c1-22(12-21-11-19-10-20-21,15-6-2-13(17)3-7-15)16-8-4-14(18)5-9-16/h2-11H,12H2,1H3
37 atoms
Si 0.170654 0.41127 1.463456
F  5.306075 -0.640563 -1.452556
F  -4.265923 -3.144483 -0.421727
N  -0.824046 2.317917 -0.322148
N  -2.120261 2.270934 -0.630108
N  -0.880149 2.341572 -2.49817
C  -0.360897 2.198997 1.045423
C  1.765448 0.066688 0.530328
C  -1.178791 -0.747412 0.874113
C  0.410157 0.309102 3.316925
C  2.009466 -1.156274 -0.098003
C  -1.386617 -0.986441 -0.487919
C  2.770437 1.037368 0.473157
C  -2.05205 -1.35187 1.780393
C  3.198832 -1.406627 -0.768399
C  -2.421528 -1.791823 -0.93615
C  3.967338 0.8117 -0.189718
C  -3.096168 -2.162731 1.356728
C  -0.10023 2.347257 -1.440036
C  4.155118 -0.411829 -0.802861
C  -3.259804 -2.364182 0.001284
C  -2.10011 2.287072 -1.939865
H  -1.174551 2.511807 1.698688
H  0.45013 2.911148 1.206846
H  -0.4914 0.601885 3.85767
H  0.681736 -0.698508 3.634743
H  1.21083 0.978959 3.635474
H  1.264606 -1.942031 -0.074554
H  -0.729437 -0.547957 -1.230004
H  2.632989 2.000549 0.950981
H  -1.92958 -1.197411 2.84548
H  3.375077 -2.357182 -1.254445
H  -2.572202 -1.970191 -1.992703
H  4.735579 1.57253 -0.229239
H  -3.766749 -2.626236 2.068088
H  0.977538 2.394037 -1.442151
H  -3.012645 2.266392 -2.514678
elementType: Si F N C H
totalener: -1272.29244907 hartree
nucrepener: 1893.69380682 hartree
electener: -3165.98625589 hartree
oneelecener: -5505.47762703 hartree
twoeener: 2339.49137115 hartree
cpcmener: -0.03001626 hartree
kineticenergy: 1267.70446268 hartree
xcener: -108.340003371299 hartree
chargesum: -0.0000000
charge: 0.457456 -0.222846 -0.223417 0.125877 -0.344499 -0.412947 -0.186344 -0.054396 -0.055711 -0.433849 -0.122526 -0.168728 -0.179470 -0.123575 -0.232242 -0.251083 -0.215750 -0.233185 0.043415 0.318185 0.323658 0.052238 0.123746 0.141602 0.111263 0.115977 0.113170 0.148279 0.144916 0.145033 0.146919 0.153689 0.151551 0.153394 0.153309 0.176613 0.160277
qa: 0.4575 -0.2228 -0.2234 0.1259 -0.3445 -0.4129 -0.1863 -0.0544 -0.0557 -0.4338 -0.1225 -0.1687 -0.1795 -0.1236 -0.2322 -0.2511 -0.2157 -0.2332 0.0434 0.3182 0.3237 0.0522 0.1237 0.1416 0.1113 0.1160 0.1132 0.1483 0.1449 0.1450 0.1469 0.1537 0.1516 0.1534 0.1533 0.1766 0.1603
va: 4.1003 1.0553 1.0546 3.3765 2.8707 3.0165 3.7796 3.6325 3.6398 3.9367 3.8174 3.8219 3.8297 3.8407 3.9324 3.9653 3.9181 3.9224 4.0497 3.8798 3.8803 4.0505 1.0190 0.9996 1.0085 1.0080 1.0097 0.9915 0.9906 0.9961 0.9893 0.9968 0.9983 0.9965 0.9975 0.9938 0.9981
dispcorr: -0.019421989 hartree
energy: -1272.311871057996
dipole: 0.53510 0.52126 1.05636 7.14928 -6.86528 0.28400 12.06473 -9.92332 2.14142
magnitude: 2.40463 au
magnitude: 6.11207 debye
