program: Orca
programVersion: 4.2.1
elementType: Si F F N N N C C C C C C C C C C C C C C C C H H H H H H H H H H H H H H H
charge: 0
multiplicity: 1
keywords: wb97x-d3
keywords: def2-TZVPP
keywords: def2/J RIJCOSX GRIDX6 NOFINALGRIDX
keywords: grid4 nofinalgrid
keywords: scfconv7
keywords: smallprint printgap noloewdin
keywords: NOSOSCF
formula: C16H15F2N3Si
InChI: InChI=1S/C16H15F2N3Si/c1-22(12-21-11-19-10-20-21,15-6-2-13(17)3-7-15)16-8-4-14(18)5-9-16/h2-11H,12H2,1H3
37 atoms
Si 0.215948 0.284278 1.489029
F  5.268248 -0.426726 -1.66421
F  -4.224095 -3.159117 -0.583516
N  -0.876207 2.322718 -0.080837
N  -2.182597 2.270668 -0.340467
N  -1.023205 2.545759 -2.240868
C  -0.354937 2.091524 1.251734
C  1.783357 0.050433 0.479411
C  -1.132781 -0.839894 0.836947
C  0.517205 0.015886 3.3160
C  2.032313 -1.1181 -0.243863
C  -1.976305 -1.53013 1.709243
C  2.764347 1.046633 0.45984
C  -1.37108 -0.966289 -0.535118
C  3.203053 -1.291108 -0.969333
C  -3.021612 -2.315985 1.243155
C  3.942345 0.898243 -0.256799
C  -2.40744 -1.744764 -1.02575
C  -0.200174 2.47418 -1.218357
C  4.135593 -0.273395 -0.962476
C  -3.216088 -2.404505 -0.120355
C  -2.217529 2.406822 -1.642818
H  -1.145379 2.331617 1.962097
H  0.451723 2.801203 1.443516
H  -0.372198 0.233835 3.909612
H  0.821325 -1.009957 3.529409
H  1.313297 0.672346 3.672323
H  1.305967 -1.921495 -0.253245
H  -1.830035 -1.4645 2.780532
H  2.623444 1.969627 1.010283
H  -0.737969 -0.457469 -1.252975
H  3.383161 -2.199334 -1.529213
H  -3.669765 -2.846998 1.927786
H  4.692318 1.678121 -0.266694
H  -2.582586 -1.834885 -2.08968
H  0.875268 2.548212 -1.259536
H  -3.152162 2.416584 -2.181246
elementType: Si F N C H
totalener: -1272.29240974 hartree
nucrepener: 1893.92768106 hartree
electener: -3166.22009079 hartree
oneelecener: -5505.95636436 hartree
twoeener: 2339.73627357 hartree
cpcmener: -0.03012307 hartree
kineticenergy: 1267.70650504 hartree
xcener: -108.340219788060 hartree
chargesum: 0.0000000
charge: 0.457443 -0.222851 -0.223533 0.125806 -0.344864 -0.413532 -0.184861 -0.050923 -0.055299 -0.434327 -0.124873 -0.123925 -0.181556 -0.167236 -0.230981 -0.233102 -0.215170 -0.250831 0.045437 0.317326 0.323442 0.051036 0.123752 0.141095 0.110586 0.116220 0.113070 0.147470 0.146485 0.144947 0.145148 0.153530 0.152949 0.153423 0.151347 0.176809 0.160545
qa: 0.4574 -0.2229 -0.2235 0.1258 -0.3449 -0.4135 -0.1849 -0.0509 -0.0553 -0.4343 -0.1249 -0.1239 -0.1816 -0.1672 -0.2310 -0.2331 -0.2152 -0.2508 0.0454 0.3173 0.3234 0.0510 0.1238 0.1411 0.1106 0.1162 0.1131 0.1475 0.1465 0.1449 0.1451 0.1535 0.1529 0.1534 0.1513 0.1768 0.1605
va: 4.1019 1.0553 1.0545 3.3780 2.8706 3.0171 3.7789 3.6327 3.6373 3.9365 3.8222 3.8403 3.8298 3.8204 3.9326 3.9224 3.9160 3.9640 4.0484 3.8809 3.8794 4.0517 1.0188 1.0000 1.0087 1.0081 1.0096 0.9919 0.9895 0.9961 0.9904 0.9968 0.9976 0.9966 0.9983 0.9936 0.9980
dispcorr: -0.019421833 hartree
energy: -1272.311831567879
dipole: 0.83238 0.30032 1.13271 6.05296 -5.93230 0.12066 12.63452 -10.51999 2.11454
magnitude: 2.40184 au
magnitude: 6.10500 debye
