program: Orca
programVersion: 4.2.1
elementType: Si F F N N N C C C C C C C C C C C C C C C C H H H H H H H H H H H H H H H
charge: 0
multiplicity: 1
keywords: wb97x-d3
keywords: def2-TZVPP
keywords: def2/J RIJCOSX GRIDX6 NOFINALGRIDX
keywords: grid4 nofinalgrid
keywords: scfconv7
keywords: smallprint printgap noloewdin
keywords: NOSOSCF
formula: C16H15F2N3Si
InChI: InChI=1S/C16H15F2N3Si/c1-22(12-21-11-19-10-20-21,15-6-2-13(17)3-7-15)16-8-4-14(18)5-9-16/h2-11H,12H2,1H3
37 atoms
Si -0.701824 0.443951 0.688924
F  4.942831 -0.200369 -1.174662
F  -3.599766 -4.783483 1.075209
N  -0.537925 2.552271 -1.081444
N  0.357203 2.33315 -2.044791
N  0.757759 4.300691 -1.044301
C  -1.485293 1.530909 -0.677472
C  1.082503 0.164368 0.201748
C  -1.6150 -1.188793 0.779132
C  -0.801091 1.382939 2.307355
C  2.080389 1.046683 0.618569
C  -2.919126 -1.332833 0.302117
C  1.438334 -0.853381 -0.685027
C  -1.006708 -2.30372 1.361977
C  3.385299 0.936031 0.161174
C  -3.5992 -2.538955 0.397345
C  2.737246 -0.991558 -1.149275
C  -1.664501 -3.519648 1.468002
C  -0.279609 3.715947 -0.487931
C  3.685092 -0.083723 -0.719814
C  -2.953932 -3.611279 0.98047
C  1.106094 3.405192 -1.982367
H  -1.756932 0.958309 -1.563378
H  -2.391982 2.025416 -0.325922
H  -0.352964 2.376641 2.246379
H  -1.842206 1.515407 2.607487
H  -0.292757 0.844958 3.10927
H  1.851708 1.849505 1.309265
H  -3.433882 -0.498384 -0.158734
H  0.69402 -1.559362 -1.033595
H  0.006031 -2.238608 1.741713
H  4.151582 1.628279 0.483807
H  -4.608916 -2.640452 0.022498
H  3.003882 -1.783545 -1.836426
H  -1.182667 -4.377253 1.918185
H  -0.880918 4.108758 0.316685
H  1.937031 3.548614 -2.654906
elementType: Si F N C H
totalener: -1272.29125893 hartree
nucrepener: 1878.45723834 hartree
electener: -3150.74849727 hartree
oneelecener: -5475.09477014 hartree
twoeener: 2324.34627287 hartree
cpcmener: -0.03065324 hartree
kineticenergy: 1267.72524530 hartree
xcener: -108.342440583162 hartree
chargesum: 0.0000000
charge: 0.504341 -0.224882 -0.223101 0.109888 -0.326739 -0.414533 -0.176017 -0.060511 -0.114534 -0.384146 -0.133587 -0.166648 -0.148903 -0.164509 -0.239622 -0.211069 -0.234051 -0.222097 0.036446 0.320871 0.306705 0.045910 0.128201 0.140251 0.100359 0.117823 0.118025 0.142389 0.137755 0.142546 0.140816 0.152096 0.153261 0.153382 0.153747 0.182037 0.158100
qa: 0.5043 -0.2249 -0.2231 0.1099 -0.3267 -0.4145 -0.1760 -0.0605 -0.1145 -0.3841 -0.1336 -0.1666 -0.1489 -0.1645 -0.2396 -0.2111 -0.2341 -0.2221 0.0364 0.3209 0.3067 0.0459 0.1282 0.1403 0.1004 0.1178 0.1180 0.1424 0.1378 0.1425 0.1408 0.1521 0.1533 0.1534 0.1537 0.1820 0.1581
va: 4.0635 1.0522 1.0545 3.4009 2.8858 3.0193 3.7832 3.6558 3.7365 3.8945 3.7963 3.8782 3.8554 3.8599 3.9322 3.9036 3.9328 3.9184 4.0590 3.8703 3.8826 4.0606 1.0089 0.9976 1.0136 1.0077 1.0060 0.9899 0.9992 0.9931 1.0006 0.9972 0.9975 0.9963 0.9965 0.9887 0.9985
dispcorr: -0.019215256 hartree
energy: -1272.310474190738
dipole: -5.94729 4.28991 -1.65738 9.99466 -10.26546 -0.27080 5.83707 -4.70622 1.13084
magnitude: 2.02461 au
magnitude: 5.14614 debye
