program: Orca
programVersion: 4.2.1
elementType: Si F F N N N C C C C C C C C C C C C C C C C H H H H H H H H H H H H H H H
charge: 0
multiplicity: 1
keywords: wb97x-d3
keywords: def2-TZVPP
keywords: def2/J RIJCOSX GRIDX6 NOFINALGRIDX
keywords: grid4 nofinalgrid
keywords: scfconv7
keywords: smallprint printgap noloewdin
keywords: NOSOSCF
formula: C16H15F2N3Si
InChI: InChI=1S/C16H15F2N3Si/c1-22(12-21-11-19-10-20-21,15-6-2-13(17)3-7-15)16-8-4-14(18)5-9-16/h2-11H,12H2,1H3
37 atoms
Si -0.59541 0.34131 0.854388
F  4.810935 -0.256364 -1.641912
F  -3.884685 -4.654327 0.539858
N  -0.442893 2.728856 -0.518887
N  0.220073 2.679853 -1.673523
N  1.067606 4.287535 -0.358421
C  -1.430638 1.726757 -0.168827
C  1.106425 0.080896 0.119153
C  -1.622238 -1.219876 0.720031
C  -0.455758 0.916519 2.632484
C  1.294945 -0.709755 -1.01642
C  -1.049536 -2.474132 0.948252
C  2.21337 0.756774 0.635667
C  -2.987459 -1.169492 0.429436
C  2.538578 -0.833481 -1.61702
C  -1.801197 -3.638407 0.88978
C  3.466666 0.6555 0.048972
C  -3.760941 -2.32006 0.366543
C  0.079164 3.677687 0.256251
C  3.60221 -0.143036 -1.068549
C  -3.147665 -3.534963 0.599155
C  1.108983 3.630728 -1.528806
H  -1.859462 1.349713 -1.096467
H  -2.238881 2.210147 0.382094
H  0.056142 0.174193 3.247436
H  0.090948 1.856047 2.733222
H  -1.447741 1.071889 3.060483
H  0.461276 -1.24738 -1.452509
H  0.006733 -2.560301 1.174405
H  2.114396 1.382345 1.514481
H  -3.477441 -0.220956 0.244573
H  2.677512 -1.451624 -2.494119
H  -1.348373 -4.605256 1.065754
H  4.319329 1.183118 0.455755
H  -4.817611 -2.271014 0.139135
H  -0.300648 3.907817 1.239485
H  1.813534 3.864181 -2.31157
elementType: Si F N C H
totalener: -1272.29136654 hartree
nucrepener: 1877.92569591 hartree
electener: -3150.21706245 hartree
oneelecener: -5474.01298497 hartree
twoeener: 2323.79592252 hartree
cpcmener: -0.03072181 hartree
kineticenergy: 1267.71381700 hartree
xcener: -108.340152038202 hartree
chargesum: -0.0000000
charge: 0.500750 -0.224550 -0.223184 0.115292 -0.327325 -0.414351 -0.175920 -0.072528 -0.115859 -0.382935 -0.147236 -0.159128 -0.133294 -0.166643 -0.229331 -0.223037 -0.233326 -0.214258 0.030048 0.318352 0.307038 0.047156 0.127962 0.141529 0.119061 0.099405 0.117604 0.141476 0.141003 0.144053 0.138889 0.152729 0.154166 0.152470 0.153091 0.181407 0.159425
qa: 0.5007 -0.2245 -0.2232 0.1153 -0.3273 -0.4144 -0.1759 -0.0725 -0.1159 -0.3829 -0.1472 -0.1591 -0.1333 -0.1666 -0.2293 -0.2230 -0.2333 -0.2143 0.0300 0.3184 0.3070 0.0472 0.1280 0.1415 0.1191 0.0994 0.1176 0.1415 0.1410 0.1441 0.1389 0.1527 0.1542 0.1525 0.1531 0.1814 0.1594
va: 4.0551 1.0527 1.0544 3.4047 2.8890 3.0149 3.7751 3.6795 3.7399 3.8945 3.8507 3.8578 3.7901 3.8770 3.9264 3.9193 3.9367 3.9084 4.0708 3.8749 3.8823 4.0545 1.0100 0.9969 1.0058 1.0138 1.0078 0.9938 0.9997 0.9893 0.9986 0.9966 0.9963 0.9969 0.9975 0.9883 0.9977
dispcorr: -0.019174919 hartree
energy: -1272.310541457750
dipole: -4.47067 2.97067 -1.50000 8.87962 -9.27443 -0.39481 8.28422 -6.95960 1.32461
magnitude: 2.03973 au
magnitude: 5.18457 debye
