program: Orca
programVersion: 4.2.1
elementType: Si F F N N N C C C C C C C C C C C C C C C C H H H H H H H H H H H H H H H
charge: 0
multiplicity: 1
keywords: wb97x-d3
keywords: def2-TZVPP
keywords: def2/J RIJCOSX GRIDX6 NOFINALGRIDX
keywords: grid4 nofinalgrid
keywords: scfconv7
keywords: smallprint printgap noloewdin
keywords: NOSOSCF
formula: C16H15F2N3Si
InChI: InChI=1S/C16H15F2N3Si/c1-22(12-21-11-19-10-20-21,15-6-2-13(17)3-7-15)16-8-4-14(18)5-9-16/h2-11H,12H2,1H3
37 atoms
Si -0.659893 0.463219 0.780989
F  4.873313 -0.261188 -1.389101
F  -3.68646 -4.704753 0.998258
N  -0.534413 2.579468 -0.975018
N  -0.052315 3.512596 -0.153381
N  1.054763 3.545083 -2.103979
C  -1.490166 1.59315 -0.520386
C  1.082474 0.188161 0.150051
C  -1.602151 -1.158431 0.813509
C  -0.651666 1.263967 2.471712
C  2.168064 0.871706 0.699525
C  -2.969236 -1.20744 0.531742
C  1.321623 -0.645747 -0.945239
C  -0.965615 -2.352312 1.16088
C  3.450793 0.728764 0.189499
C  -3.683103 -2.395806 0.591193
C  2.594015 -0.806432 -1.472553
C  -1.656695 -3.553305 1.226754
C  0.143953 2.597624 -2.118147
C  3.636112 -0.111085 -0.889966
C  -3.00757 -3.548765 0.93917
C  0.891278 4.06353 -0.876969
H  -1.79834 1.011297 -1.390063
H  -2.380692 2.100192 -0.147025
H  -0.156708 0.626689 3.207178
H  -0.148468 2.231365 2.467609
H  -1.673126 1.429977 2.817705
H  2.028696 1.529603 1.547974
H  -3.508485 -0.308579 0.257099
H  0.506526 -1.193389 -1.404087
H  0.094385 -2.361836 1.384568
H  4.287443 1.259116 0.624642
H  -4.741614 -2.422765 0.369403
H  2.771533 -1.458358 -2.317449
H  -1.15392 -4.472864 1.49508
H  -0.065607 1.923304 -2.932757
H  1.479008 4.885904 -0.501025
elementType: Si F N C H
totalener: -1272.29248610 hartree
nucrepener: 1880.12386535 hartree
electener: -3152.41635146 hartree
oneelecener: -5478.36773673 hartree
twoeener: 2325.95138527 hartree
cpcmener: -0.02924287 hartree
kineticenergy: 1267.72762266 hartree
xcener: -108.343281462858 hartree
chargesum: 0.0000000
charge: 0.519817 -0.224513 -0.223707 0.129396 -0.358161 -0.412199 -0.181317 -0.086475 -0.120681 -0.392972 -0.127275 -0.166390 -0.148112 -0.151304 -0.232031 -0.215700 -0.229174 -0.222486 0.056526 0.321541 0.306035 0.054635 0.129042 0.130207 0.118579 0.100934 0.115865 0.142594 0.139553 0.141141 0.141271 0.152461 0.152758 0.153465 0.154424 0.172096 0.160161
qa: 0.5198 -0.2245 -0.2237 0.1294 -0.3582 -0.4122 -0.1813 -0.0865 -0.1207 -0.3930 -0.1273 -0.1664 -0.1481 -0.1513 -0.2320 -0.2157 -0.2292 -0.2225 0.0565 0.3215 0.3060 0.0546 0.1290 0.1302 0.1186 0.1009 0.1159 0.1426 0.1396 0.1411 0.1413 0.1525 0.1528 0.1535 0.1544 0.1721 0.1602
va: 4.0258 1.0529 1.0535 3.3776 2.8549 3.0162 3.8058 3.6745 3.7175 3.8773 3.8021 3.8730 3.8387 3.8443 3.9325 3.9083 3.9216 3.9177 4.0476 3.8735 3.8805 4.0449 1.0008 1.0041 1.0059 1.0243 1.0082 0.9945 0.9972 0.9957 0.9980 0.9967 0.9975 0.9961 0.9961 0.9947 0.9963
dispcorr: -0.019151040 hartree
energy: -1272.311637143298
dipole: -5.13552 3.75385 -1.38166 8.92838 -9.66582 -0.73745 5.50998 -5.13436 0.37562
magnitude: 1.61056 au
magnitude: 4.09373 debye
