program: Orca
programVersion: 4.2.1
elementType: Si F F N N N C C C C C C C C C C C C C C C C H H H H H H H H H H H H H H H
charge: 0
multiplicity: 1
keywords: wb97x-d3
keywords: def2-TZVPP
keywords: def2/J RIJCOSX GRIDX6 NOFINALGRIDX
keywords: grid4 nofinalgrid
keywords: scfconv7
keywords: smallprint printgap noloewdin
keywords: NOSOSCF
formula: C16H15F2N3Si
InChI: InChI=1S/C16H15F2N3Si/c1-22(12-21-11-19-10-20-21,15-6-2-13(17)3-7-15)16-8-4-14(18)5-9-16/h2-11H,12H2,1H3
37 atoms
Si -0.653333 0.374417 0.84601
F  4.862624 -0.133886 -1.407493
F  -3.881442 -4.662339 0.542322
N  -0.409736 2.635788 -0.71916
N  0.301043 2.444762 -1.830479
N  1.139898 4.162698 -0.656988
C  -1.43261 1.697913 -0.302443
C  1.090777 0.102125 0.221838
C  -1.661044 -1.200972 0.732328
C  -0.623452 1.07123 2.58659
C  1.355909 -0.736845 -0.862695
C  -3.012148 -1.172427 0.378434
C  2.148776 0.847769 0.744636
C  -1.088437 -2.442282 1.022275
C  2.624266 -0.831228 -1.414517
C  -3.771493 -2.33204 0.312264
C  3.424297 0.78009 0.202844
C  -1.826304 -3.61533 0.961615
C  0.109219 3.647052 -0.02543
C  3.633827 -0.05973 -0.872107
C  -3.158567 -3.533993 0.605987
C  1.211755 3.38266 -1.747554
H  -1.872331 1.264667 -1.19967
H  -2.224064 2.251683 0.204585
H  -1.640238 1.217079 2.955945
H  -0.111965 0.400681 3.278886
H  -0.12049 2.039384 2.635753
H  0.562775 -1.331708 -1.300109
H  -3.500998 -0.234208 0.14393
H  1.992089 1.506463 1.590275
H  -0.042789 -2.510722 1.298258
H  2.82265 -1.485058 -2.253776
H  -4.816782 -2.299548 0.034532
H  4.236505 1.366972 0.611183
H  -1.37272 -4.572235 1.184185
H  -0.305005 3.987702 0.910653
H  1.955825 3.510925 -2.518217
elementType: Si F N C H
totalener: -1272.29082678 hartree
nucrepener: 1883.87689598 hartree
electener: -3156.16772276 hartree
oneelecener: -5485.97163123 hartree
twoeener: 2329.80390848 hartree
cpcmener: -0.03080734 hartree
kineticenergy: 1267.70921281 hartree
xcener: -108.339848704074 hartree
chargesum: 0.0000000
charge: 0.501326 -0.224604 -0.223108 0.116582 -0.325489 -0.414217 -0.182089 -0.074689 -0.110519 -0.381725 -0.143219 -0.167710 -0.138461 -0.159477 -0.232959 -0.214312 -0.231989 -0.223755 0.026304 0.320268 0.307415 0.050382 0.128506 0.142600 0.116829 0.118893 0.098574 0.142321 0.139624 0.145552 0.141741 0.153093 0.153424 0.152127 0.154356 0.180536 0.157868
qa: 0.5013 -0.2246 -0.2231 0.1166 -0.3255 -0.4142 -0.1821 -0.0747 -0.1105 -0.3817 -0.1432 -0.1677 -0.1385 -0.1595 -0.2330 -0.2143 -0.2320 -0.2238 0.0263 0.3203 0.3074 0.0504 0.1285 0.1426 0.1168 0.1189 0.0986 0.1423 0.1396 0.1456 0.1417 0.1531 0.1534 0.1521 0.1544 0.1805 0.1579
va: 4.0525 1.0528 1.0545 3.4033 2.8884 3.0111 3.7723 3.6879 3.7392 3.8932 3.8459 3.8767 3.7887 3.8557 3.9317 3.9072 3.9317 3.9188 4.0765 3.8715 3.8823 4.0520 1.0100 0.9963 1.0085 1.0058 1.0137 0.9927 0.9982 0.9887 0.9999 0.9963 0.9974 0.9969 0.9962 0.9896 0.9982
dispcorr: -0.019436970 hartree
energy: -1272.310263751731
dipole: -4.97336 3.39032 -1.58304 9.22236 -9.48232 -0.25996 7.82049 -6.48412 1.33637
magnitude: 2.08793 au
magnitude: 5.30711 debye
