program: Orca
programVersion: 4.2.1
elementType: Si F F N N N C C C C C C C C C C C C C C C C H H H H H H H H H H H H H H H
charge: 0
multiplicity: 1
keywords: wb97x-d3
keywords: def2-TZVPP
keywords: def2/J RIJCOSX GRIDX6 NOFINALGRIDX
keywords: grid4 nofinalgrid
keywords: scfconv7
keywords: smallprint printgap noloewdin
keywords: NOSOSCF
formula: C16H15F2N3Si
InChI: InChI=1S/C16H15F2N3Si/c1-22(12-21-11-19-10-20-21,15-6-2-13(17)3-7-15)16-8-4-14(18)5-9-16/h2-11H,12H2,1H3
37 atoms
Si 0.034365 0.547844 0.309902
F  5.719421 -1.277055 -0.205754
F  -3.464888 -4.324287 0.164124
N  -1.234507 2.758511 -0.87876
N  -2.517907 2.502555 -0.623615
N  -2.087531 4.681269 -0.322919
C  -0.289925 1.706248 -1.182353
C  1.815343 -0.025289 0.169275
C  -1.072021 -0.970927 0.23773
C  -0.224929 1.544068 1.87403
C  2.233858 -0.764084 -0.941937
C  -2.418204 -0.89036 -0.13094
C  2.765234 0.27742 1.145552
C  -0.56759 -2.227548 0.582933
C  3.54594 -1.189753 -1.08051
C  -3.233079 -2.012844 -0.15844
C  4.085076 -0.139263 1.030966
C  -1.363285 -3.364643 0.56326
C  -0.991375 4.051321 -0.684641
C  4.447685 -0.866916 -0.084101
C  -2.685557 -3.23194 0.190311
C  -2.985738 3.684067 -0.301338
H  0.648814 2.190251 -1.454706
H  -0.625679 1.164968 -2.068157
H  0.388723 2.447128 1.884984
H  -1.267165 1.852782 1.973192
H  0.022717 0.961278 2.762813
H  1.528944 -1.025842 -1.722921
H  -2.850007 0.063578 -0.407679
H  2.487005 0.847278 2.023641
H  0.4697 -2.339943 0.873914
H  3.85977 -1.76265 -1.943151
H  -4.272984 -1.939747 -0.448885
H  4.813438 0.097592 1.795355
H  -0.960263 -4.332425 0.831354
H  -0.016224 4.490011 -0.824754
H  -4.023396 3.826501 -0.042877
elementType: Si F N C H
totalener: -1272.29155380 hartree
nucrepener: 1838.70141145 hartree
electener: -3110.99296525 hartree
oneelecener: -5395.33407287 hartree
twoeener: 2284.34110762 hartree
cpcmener: -0.02701007 hartree
kineticenergy: 1267.70499067 hartree
xcener: -108.339656894969 hartree
chargesum: 0.0000000
charge: 0.463141 -0.223840 -0.224409 0.125352 -0.373057 -0.423648 -0.175624 -0.122134 -0.095114 -0.415111 -0.175368 -0.135423 -0.118758 -0.129855 -0.213172 -0.237374 -0.227468 -0.230875 0.069168 0.309574 0.318305 0.077087 0.123647 0.136627 0.118210 0.116299 0.121683 0.142411 0.158503 0.148536 0.145117 0.154067 0.149874 0.152516 0.152942 0.178213 0.159957
qa: 0.4631 -0.2238 -0.2244 0.1254 -0.3731 -0.4236 -0.1756 -0.1221 -0.0951 -0.4151 -0.1754 -0.1354 -0.1188 -0.1299 -0.2132 -0.2374 -0.2275 -0.2309 0.0692 0.3096 0.3183 0.0771 0.1236 0.1366 0.1182 0.1163 0.1217 0.1424 0.1585 0.1485 0.1451 0.1541 0.1499 0.1525 0.1529 0.1782 0.1600
va: 4.0430 1.0534 1.0526 3.3538 2.8270 3.0205 3.7765 3.7252 3.7657 3.9048 3.8673 3.7676 3.8254 3.8239 3.9027 3.9501 3.9259 3.9188 4.0251 3.8789 3.8754 4.0192 1.0046 1.0007 1.0036 1.0128 1.0087 0.9964 1.0246 0.9888 0.9916 0.9964 1.0010 0.9980 0.9972 0.9913 0.9942
dispcorr: -0.017787157 hartree
energy: -1272.309340954868
dipole: -1.89252 3.19016 1.29764 11.28281 -11.34364 -0.06082 3.02868 -3.22589 -0.19721
magnitude: 1.31395 au
magnitude: 3.33980 debye
