program: Orca
programVersion: 4.2.1
elementType: Si F F N N N C C C C C C C C C C C C C C C C H H H H H H H H H H H H H H H
charge: 0
multiplicity: 1
keywords: wb97x-d3
keywords: def2-TZVPP
keywords: def2/J RIJCOSX GRIDX6 NOFINALGRIDX
keywords: grid4 nofinalgrid
keywords: scfconv7
keywords: smallprint printgap noloewdin
keywords: NOSOSCF
formula: C16H15F2N3Si
InChI: InChI=1S/C16H15F2N3Si/c1-22(12-21-11-19-10-20-21,15-6-2-13(17)3-7-15)16-8-4-14(18)5-9-16/h2-11H,12H2,1H3
37 atoms
Si 0.125237 0.60083 0.233047
F  5.753428 -1.415313 -0.201307
F  -3.626529 -4.034419 0.852145
N  -1.33285 2.548096 -1.189562
N  -1.106271 3.754461 -0.671666
N  -3.284362 3.496216 -1.111733
C  -0.25365 1.596482 -1.352951
C  1.8766 -0.057674 0.075075
C  -1.074926 -0.832792 0.394924
C  0.009862 1.725043 1.726786
C  2.959908 0.816673 0.205577
C  -1.887997 -1.265184 -0.653705
C  2.152195 -1.40568 -0.15796
C  -1.15626 -1.52751 1.606244
C  4.269844 0.372425 0.112855
C  -2.754845 -2.340029 -0.512149
C  3.455208 -1.875146 -0.254502
C  -2.007254 -2.60947 1.771008
C  -2.633842 2.403479 -1.442432
C  4.490284 -0.972794 -0.113514
C  -2.794361 -2.994035 0.702367
C  -2.303319 4.288157 -0.645776
H  0.632972 2.154322 -1.65769
H  -0.490127 0.94277 -2.193995
H  -1.010308 2.073634 1.8952
H  0.330951 1.201045 2.629662
H  0.644418 2.606813 1.622467
H  2.794714 1.872611 0.388105
H  -1.856311 -0.772296 -1.617425
H  1.342666 -2.117898 -0.264631
H  -0.542358 -1.232437 2.449544
H  5.101432 1.056994 0.219122
H  -3.383823 -2.66111 -1.332269
H  3.660169 -2.922939 -0.432325
H  -2.058069 -3.142839 2.711382
H  -3.057563 1.507345 -1.868402
H  -2.46997 5.291349 -0.284725
elementType: Si F N C H
totalener: -1272.30146107 hartree
nucrepener: 1836.23953618 hartree
electener: -3108.54099725 hartree
oneelecener: -5390.12808818 hartree
twoeener: 2281.58709093 hartree
cpcmener: -0.02572743 hartree
kineticenergy: 1267.67876985 hartree
xcener: -108.332967296897 hartree
chargesum: 0.0000000
charge: 0.472449 -0.220963 -0.220021 0.119156 -0.348395 -0.421487 -0.207061 -0.116686 -0.089727 -0.409302 -0.133931 -0.125434 -0.113397 -0.128411 -0.224503 -0.244446 -0.225164 -0.230746 0.076523 0.310855 0.325246 0.062612 0.128267 0.132451 0.114903 0.117469 0.112275 0.137552 0.142179 0.143014 0.137732 0.150004 0.149861 0.150314 0.150608 0.164005 0.162199
qa: 0.4724 -0.2210 -0.2200 0.1192 -0.3484 -0.4215 -0.2071 -0.1167 -0.0897 -0.4093 -0.1339 -0.1254 -0.1134 -0.1284 -0.2245 -0.2444 -0.2252 -0.2307 0.0765 0.3109 0.3252 0.0626 0.1283 0.1325 0.1149 0.1175 0.1123 0.1376 0.1422 0.1430 0.1377 0.1500 0.1499 0.1503 0.1506 0.1640 0.1622
va: 4.0850 1.0578 1.0598 3.3789 2.8768 3.0346 3.8030 3.7603 3.7533 3.9022 3.8497 3.8277 3.8232 3.8669 3.9320 3.9581 3.9201 3.9358 4.0430 3.8868 3.8755 4.0418 1.0173 0.9992 1.0078 1.0108 1.0153 0.9944 0.9934 0.9905 0.9975 0.9987 0.9997 0.9980 0.9982 0.9982 0.9947
dispcorr: -0.017688552 hartree
energy: -1272.319149619265
dipole: -2.02328 2.72922 0.70594 10.55243 -11.36961 -0.81718 1.60305 -1.81102 -0.20796
magnitude: 1.09972 au
magnitude: 2.79527 debye
