program: Orca
programVersion: 4.2.1
elementType: Si F F N N N C C C C C C C C C C C C C C C C H H H H H H H H H H H H H H H
charge: 0
multiplicity: 1
keywords: wb97x-d3
keywords: def2-TZVPP
keywords: def2/J RIJCOSX GRIDX6 NOFINALGRIDX
keywords: grid4 nofinalgrid
keywords: scfconv7
keywords: smallprint printgap noloewdin
keywords: NOSOSCF
formula: C16H15F2N3Si
InChI: InChI=1S/C16H15F2N3Si/c1-22(12-21-11-19-10-20-21,15-6-2-13(17)3-7-15)16-8-4-14(18)5-9-16/h2-11H,12H2,1H3
37 atoms
Si 0.303838 0.607409 0.654391
F  5.822189 -1.357342 -0.621805
F  -3.664357 -3.730645 -0.500266
N  -1.342442 2.644514 -0.391338
N  -2.242861 2.389856 -1.339716
N  -3.164876 3.603619 0.297545
C  0.006362 2.120657 -0.469252
C  2.032804 -0.012411 0.264264
C  -0.9664 -0.716429 0.270794
C  0.183261 1.124294 2.451489
C  2.267628 -0.833536 -0.841621
C  -1.348579 -1.618007 1.268102
C  3.126831 0.338959 1.057962
C  -1.534951 -0.86878 -0.996254
C  3.539608 -1.290159 -1.152403
C  -2.255554 -2.63769 1.021255
C  4.408949 -0.107238 0.769466
C  -2.444284 -1.881401 -1.267618
C  -1.903868 3.364935 0.580247
C  4.588669 -0.916004 -0.334983
C  -2.786027 -2.748667 -0.249076
C  -3.319346 2.98362 -0.885192
H  0.710035 2.912962 -0.204198
H  0.204544 1.883244 -1.51454
H  -0.840585 1.384933 2.726078
H  0.500124 0.324365 3.123596
H  0.809513 1.992345 2.66663
H  1.447725 -1.140648 -1.481021
H  -0.938805 -1.536233 2.268012
H  2.99346 0.970039 1.928521
H  -1.283829 -0.187735 -1.799374
H  3.710266 -1.928655 -2.009522
H  -2.544503 -3.329442 1.801917
H  5.249348 0.166237 1.394308
H  -2.880313 -1.989986 -2.252224
H  -1.36472 3.698457 1.453556
H  -4.249055 2.970452 -1.43285
elementType: Si F N C H
totalener: -1272.30195906 hartree
nucrepener: 1847.69286797 hartree
electener: -3119.99482703 hartree
oneelecener: -5413.36622884 hartree
twoeener: 2293.37140180 hartree
cpcmener: -0.02617688 hartree
kineticenergy: 1267.68126740 hartree
xcener: -108.334008455870 hartree
chargesum: -0.0000000
charge: 0.459641 -0.220839 -0.221068 0.112844 -0.352004 -0.421721 -0.183417 -0.128045 -0.052652 -0.469402 -0.123340 -0.130920 -0.113147 -0.145041 -0.228724 -0.227816 -0.223804 -0.220284 0.059993 0.312251 0.311999 0.065685 0.138515 0.125258 0.126971 0.125846 0.124609 0.143614 0.139062 0.142927 0.131504 0.149594 0.150211 0.150745 0.150634 0.179118 0.161202
qa: 0.4596 -0.2208 -0.2211 0.1128 -0.3520 -0.4217 -0.1834 -0.1280 -0.0527 -0.4694 -0.1233 -0.1309 -0.1131 -0.1450 -0.2287 -0.2278 -0.2238 -0.2203 0.0600 0.3123 0.3120 0.0657 0.1385 0.1253 0.1270 0.1258 0.1246 0.1436 0.1391 0.1429 0.1315 0.1496 0.1502 0.1507 0.1506 0.1791 0.1612
va: 4.1097 1.0580 1.0581 3.3770 2.8586 3.0313 3.7785 3.8143 3.6975 3.9267 3.8383 3.8573 3.8175 3.7998 3.9357 3.9239 3.9221 3.9355 4.0429 3.8826 3.8936 4.0354 1.0019 1.0123 1.0040 1.0081 1.0023 0.9917 0.9923 0.9897 1.0165 0.9992 0.9982 0.9984 0.9975 0.9867 0.9947
dispcorr: -0.017867562 hartree
energy: -1272.319826621421
dipole: -0.61295 2.13865 1.52570 10.41063 -10.19343 0.21720 7.19053 -6.38999 0.80054
magnitude: 1.73661 au
magnitude: 4.41410 debye
