program: Orca
programVersion: 4.2.1
elementType: Si F F N N N C C C C C C C C C C C C C C C C H H H H H H H H H H H H H H H
charge: 0
multiplicity: 1
keywords: wb97x-d3
keywords: def2-TZVPP
keywords: def2/J RIJCOSX GRIDX6 NOFINALGRIDX
keywords: grid4 nofinalgrid
keywords: scfconv7
keywords: smallprint printgap noloewdin
keywords: NOSOSCF
formula: C16H15F2N3Si
InChI: InChI=1S/C16H15F2N3Si/c1-22(12-21-11-19-10-20-21,15-6-2-13(17)3-7-15)16-8-4-14(18)5-9-16/h2-11H,12H2,1H3
37 atoms
Si -0.551951 0.41716 0.833797
F  4.830657 -0.42237 -1.653494
F  -3.666619 -4.708709 0.919522
N  -0.587115 2.693286 -0.758912
N  0.137305 3.38845 0.11661
N  0.576235 4.070044 -1.967544
C  -1.467515 1.63273 -0.324333
C  1.141267 0.121713 0.088903
C  -1.531354 -1.186846 0.819143
C  -0.436326 1.082728 2.578612
C  2.290174 0.686536 0.644355
C  -0.898536 -2.41006 1.05495
C  1.283131 -0.630586 -1.079784
C  -2.914166 -1.200116 0.62107
C  3.539749 0.508958 0.067751
C  -1.606177 -3.60269 1.091534
C  2.520379 -0.821301 -1.676653
C  -3.644857 -2.379509 0.652497
C  -0.31522 3.104209 -1.996216
C  3.627855 -0.243837 -1.086138
C  -2.971585 -3.561733 0.888171
C  0.815435 4.20596 -0.651919
H  -1.815027 1.10888 -1.216107
H  -2.349462 2.068869 0.151476
H  -1.436295 1.240875 2.988496
H  0.074829 0.377372 3.237852
H  0.088869 2.037493 2.623771
H  2.225008 1.281847 1.546589
H  0.17301 -2.44974 1.212294
H  0.417495 -1.088911 -1.544667
H  -3.454548 -0.278869 0.436533
H  4.425695 0.949234 0.506725
H  -1.104533 -4.544352 1.273169
H  2.621487 -1.406868 -2.581212
H  -4.715664 -2.377435 0.495489
H  -0.780055 2.678158 -2.871702
H  1.511166 4.924219 -0.244874
elementType: Si F N C H
totalener: -1272.30307862 hartree
nucrepener: 1865.90714904 hartree
electener: -3138.21022766 hartree
oneelecener: -5450.00760343 hartree
twoeener: 2311.79737577 hartree
cpcmener: -0.02531398 hartree
kineticenergy: 1267.68801380 hartree
xcener: -108.336517350966 hartree
chargesum: -0.0000000
charge: 0.530361 -0.221988 -0.221546 0.141024 -0.363992 -0.417987 -0.197407 -0.090057 -0.118811 -0.397802 -0.116938 -0.145782 -0.160808 -0.160072 -0.219951 -0.221291 -0.216653 -0.215830 0.057866 0.312104 0.304579 0.072050 0.121742 0.128225 0.113278 0.115617 0.106082 0.138741 0.139011 0.138156 0.136502 0.149627 0.151390 0.149975 0.149605 0.171863 0.159117
qa: 0.5304 -0.2220 -0.2215 0.1410 -0.3640 -0.4180 -0.1974 -0.0901 -0.1188 -0.3978 -0.1169 -0.1458 -0.1608 -0.1601 -0.2200 -0.2213 -0.2167 -0.2158 0.0579 0.3121 0.3046 0.0721 0.1217 0.1282 0.1133 0.1156 0.1061 0.1387 0.1390 0.1382 0.1365 0.1496 0.1514 0.1500 0.1496 0.1719 0.1591
va: 4.0288 1.0566 1.0568 3.3641 2.8397 3.0238 3.8220 3.6710 3.7245 3.8745 3.8075 3.8469 3.8550 3.8670 3.9218 3.9225 3.9150 3.9176 4.0395 3.8877 3.8896 4.0200 1.0025 0.9996 1.0089 1.0066 1.0254 0.9967 0.9974 0.9971 0.9974 0.9977 0.9972 0.9976 0.9986 0.9932 0.9946
dispcorr: -0.018356920 hartree
energy: -1272.321435536423
dipole: -4.80992 3.52663 -1.28329 8.84948 -9.47040 -0.62092 6.28719 -5.89769 0.38950
magnitude: 1.47787 au
magnitude: 3.75644 debye
