program: Orca
programVersion: 4.2.1
elementType: Si F F N N N C C C C C C C C C C C C C C C C H H H H H H H H H H H H H H H
charge: 0
multiplicity: 1
keywords: wb97x-d3
keywords: def2-TZVPP
keywords: def2/J RIJCOSX GRIDX6 NOFINALGRIDX
keywords: grid4 nofinalgrid
keywords: scfconv7
keywords: smallprint printgap noloewdin
keywords: NOSOSCF
formula: C16H15F2N3Si
InChI: InChI=1S/C16H15F2N3Si/c1-22(12-21-11-19-10-20-21,15-6-2-13(17)3-7-15)16-8-4-14(18)5-9-16/h2-11H,12H2,1H3
37 atoms
Si -0.029382 0.347448 1.46057
F  4.912674 -0.406351 -1.837921
F  -4.245546 -3.67182 0.037996
N  -0.594735 2.442254 -0.314197
N  0.438187 3.098756 -0.839561
N  -1.010926 2.524614 -2.444135
C  -0.637925 2.12127 1.097666
C  1.516434 0.055674 0.443642
C  -1.356281 -0.879783 0.948272
C  0.313579 0.222044 3.297282
C  1.436408 -0.245787 -0.918835
C  -1.012738 -2.185358 0.586343
C  2.786907 0.19084 1.006047
C  -2.714683 -0.557083 0.993713
C  2.572573 -0.40337 -1.697359
C  -1.976299 -3.134696 0.279179
C  3.939464 0.037087 0.248197
C  -3.697569 -1.486824 0.685686
C  -1.448171 2.098269 -1.280321
C  3.806648 -0.256069 -1.094259
C  -3.305342 -2.763146 0.334111
C  0.14477 3.128379 -2.116714
H  -1.645376 2.303466 1.475979
H  0.00789 2.834536 1.610259
H  0.70323 -0.762556 3.562916
H  1.030902 0.969861 3.640145
H  -0.606074 0.369874 3.867405
H  0.472623 -0.369498 -1.398897
H  0.027866 -2.484476 0.540744
H  2.89916 0.420721 2.058946
H  -3.037193 0.437389 1.279114
H  2.498788 -0.636731 -2.751661
H  -1.697191 -4.14339 0.00337
H  4.919453 0.143068 0.695049
H  -4.746291 -1.222047 0.721786
H  -2.363008 1.556838 -1.095021
H  0.791229 3.60703 -2.835984
elementType: Si F N C H
totalener: -1272.30146456 hartree
nucrepener: 1887.76818578 hartree
electener: -3160.06965034 hartree
oneelecener: -5493.64342120 hartree
twoeener: 2333.57377086 hartree
cpcmener: -0.02687237 hartree
kineticenergy: 1267.67797488 hartree
xcener: -108.334218963388 hartree
chargesum: 0.0000000
charge: 0.439508 -0.221187 -0.219957 0.128335 -0.342338 -0.408252 -0.187896 -0.053620 -0.016964 -0.430492 -0.154814 -0.143895 -0.133337 -0.192133 -0.234319 -0.224791 -0.223353 -0.213291 0.047281 0.314290 0.313127 0.051316 0.137078 0.124353 0.115485 0.107218 0.113015 0.140660 0.142613 0.140849 0.148802 0.150301 0.151013 0.150006 0.151286 0.174065 0.160037
qa: 0.4395 -0.2212 -0.2200 0.1283 -0.3423 -0.4083 -0.1879 -0.0536 -0.0170 -0.4305 -0.1548 -0.1439 -0.1333 -0.1921 -0.2343 -0.2248 -0.2234 -0.2133 0.0473 0.3143 0.3131 0.0513 0.1371 0.1244 0.1155 0.1072 0.1130 0.1407 0.1426 0.1408 0.1488 0.1503 0.1510 0.1500 0.1513 0.1741 0.1600
va: 4.1199 1.0580 1.0598 3.3778 2.8719 3.0290 3.7798 3.6350 3.6458 3.9321 3.8312 3.8617 3.8523 3.8426 3.9485 3.9276 3.9201 3.9236 4.0521 3.8934 3.8931 4.0517 0.9992 1.0190 1.0087 1.0093 1.0094 0.9934 0.9950 0.9918 0.9919 0.9978 0.9972 0.9980 0.9975 0.9947 0.9971
dispcorr: -0.019213844 hartree
energy: -1272.320678405211
dipole: -1.28857 0.75814 -0.53043 6.65740 -6.92135 -0.26395 12.17082 -9.98407 2.18675
magnitude: 2.26560 au
magnitude: 5.75869 debye
