program: Orca
programVersion: 4.2.1
elementType: Si F F N N N C C C C C C C C C C C C C C C C H H H H H H H H H H H H H H H
charge: 0
multiplicity: 1
keywords: wb97x-d3
keywords: def2-TZVPP
keywords: def2/J RIJCOSX GRIDX6 NOFINALGRIDX
keywords: grid4 nofinalgrid
keywords: scfconv7
keywords: smallprint printgap noloewdin
keywords: NOSOSCF
formula: C16H15F2N3Si
InChI: InChI=1S/C16H15F2N3Si/c1-22(12-21-11-19-10-20-21,15-6-2-13(17)3-7-15)16-8-4-14(18)5-9-16/h2-11H,12H2,1H3
37 atoms
Si 0.170936 0.406941 1.461348
F  5.310801 -0.642546 -1.450199
F  -4.271478 -3.144684 -0.419096
N  -0.822734 2.311026 -0.333306
N  -2.119165 2.263655 -0.636698
N  -0.891259 2.374324 -2.503385
C  -0.367071 2.192833 1.036818
C  1.769584 0.060657 0.534689
C  -1.177996 -0.755031 0.87776
C  0.416199 0.313902 3.31597
C  2.014755 -1.161427 -0.094937
C  -1.387465 -0.99306 -0.484124
C  2.775744 1.030189 0.480818
C  -2.05189 -1.359079 1.783576
C  3.204222 -1.410525 -0.765471
C  -2.423965 -1.795867 -0.932832
C  3.972668 0.805877 -0.182266
C  -3.097737 -2.16734 1.359447
C  -0.099846 2.372172 -1.453533
C  4.160841 -0.41595 -0.79894
C  -3.263565 -2.367321 0.003834
C  -2.11354 2.306453 -1.947031
H  -1.191299 2.497212 1.681841
H  0.436117 2.91201 1.208009
H  -0.480804 0.609302 3.863561
H  0.691082 -0.691883 3.638223
H  1.219577 0.98408 3.629122
H  1.27044 -1.94805 -0.072459
H  -0.730948 -0.554962 -1.227134
H  2.639661 1.992171 0.961952
H  -1.929462 -1.20657 2.84918
H  3.380044 -2.360516 -1.25345
H  -2.575473 -1.971294 -1.99007
H  4.741286 1.566891 -0.219804
H  -3.769277 -2.63015 2.070899
H  0.978111 2.42059 -1.458773
H  -3.028217 2.289406 -2.51919
elementType: Si F N C H
totalener: -1272.30138262 hartree
nucrepener: 1891.59944022 hartree
electener: -3163.90082284 hartree
oneelecener: -5501.28578463 hartree
twoeener: 2337.38496179 hartree
cpcmener: -0.02635726 hartree
kineticenergy: 1267.66970217 hartree
xcener: -108.333549316618 hartree
chargesum: 0.0000000
charge: 0.451156 -0.220186 -0.221003 0.123930 -0.339623 -0.406988 -0.188766 -0.050359 -0.054676 -0.431524 -0.120401 -0.165814 -0.180656 -0.121339 -0.227997 -0.247199 -0.212394 -0.229530 0.043809 0.315736 0.321668 0.053139 0.123587 0.138624 0.109982 0.115568 0.111715 0.146656 0.143472 0.141624 0.143608 0.151220 0.149290 0.150658 0.150315 0.173834 0.158860
qa: 0.4512 -0.2202 -0.2210 0.1239 -0.3396 -0.4070 -0.1888 -0.0504 -0.0547 -0.4315 -0.1204 -0.1658 -0.1807 -0.1213 -0.2280 -0.2472 -0.2124 -0.2295 0.0438 0.3157 0.3217 0.0531 0.1236 0.1386 0.1100 0.1156 0.1117 0.1467 0.1435 0.1416 0.1436 0.1512 0.1493 0.1507 0.1503 0.1738 0.1589
va: 4.1062 1.0594 1.0585 3.3698 2.8675 3.0212 3.7816 3.6373 3.6484 3.9354 3.8211 3.8264 3.8339 3.8446 3.9339 3.9659 3.9211 3.9260 4.0486 3.8909 3.8903 4.0477 1.0199 0.9995 1.0087 1.0082 1.0101 0.9924 0.9900 0.9965 0.9902 0.9976 0.9988 0.9974 0.9984 0.9943 0.9980
dispcorr: -0.019376390 hartree
energy: -1272.320759007019
dipole: 0.53505 0.47023 1.00528 7.16773 -6.92333 0.24440 12.06417 -10.01319 2.05098
magnitude: 2.29714 au
magnitude: 5.83885 debye
