program: Orca
programVersion: 4.2.1
elementType: Si F F N N N C C C C C C C C C C C C C C C C H H H H H H H H H H H H H H H
charge: 0
multiplicity: 1
keywords: wb97x-d3
keywords: def2-TZVPP
keywords: def2/J RIJCOSX GRIDX6 NOFINALGRIDX
keywords: grid4 nofinalgrid
keywords: scfconv7
keywords: smallprint printgap noloewdin
keywords: NOSOSCF
formula: C16H15F2N3Si
InChI: InChI=1S/C16H15F2N3Si/c1-22(12-21-11-19-10-20-21,15-6-2-13(17)3-7-15)16-8-4-14(18)5-9-16/h2-11H,12H2,1H3
37 atoms
Si 0.378054 0.665046 0.672323
F  5.895225 -1.43452 -0.356738
F  -3.866323 -3.356215 -0.614053
N  -1.34909 2.482421 -0.520907
N  -2.167724 1.946244 -1.423766
N  -3.318285 3.234715 -0.001267
C  0.060076 2.146513 -0.492333
C  2.099419 0.009814 0.32318
C  -0.912987 -0.641438 0.309767
C  0.221188 1.254355 2.444621
C  2.487836 -1.249402 0.7897
C  -2.101823 -0.690182 1.039953
C  3.043314 0.762317 -0.378661
C  -0.756471 -1.546917 -0.741699
C  3.763147 -1.746354 0.567569
C  -3.10566 -1.598297 0.737144
C  4.325889 0.287121 -0.613696
C  -1.742312 -2.468669 -1.060527
C  -2.04518 3.242584 0.325479
C  4.659857 -0.963244 -0.133805
C  -2.903534 -2.471868 -0.312408
C  -3.336174 2.427655 -1.07669
H  0.618273 3.029462 -0.176127
H  0.363981 1.929451 -1.516412
H  0.385741 0.434769 3.147252
H  0.963485 2.025242 2.661685
H  -0.759899 1.678318 2.667888
H  1.787795 -1.870378 1.336894
H  -2.268124 -0.011642 1.867962
H  2.794119 1.744613 -0.761646
H  0.151106 -1.545339 -1.334059
H  4.052884 -2.723607 0.931236
H  -4.024852 -1.625352 1.30765
H  5.048115 0.879007 -1.160755
H  -1.610498 -3.168571 -1.875417
H  -1.589977 3.783038 1.14109
H  -4.234125 2.187674 -1.624726
elementType: Si F N C H
totalener: -1272.30151988 hartree
nucrepener: 1864.29582240 hartree
electener: -3136.59734229 hartree
oneelecener: -5446.70742623 hartree
twoeener: 2310.11008395 hartree
cpcmener: -0.02734350 hartree
kineticenergy: 1267.68783080 hartree
xcener: -108.334938811410 hartree
chargesum: 0.0000000
charge: 0.506499 -0.220490 -0.221653 0.111130 -0.332532 -0.411726 -0.184168 -0.116214 -0.072050 -0.399189 -0.163846 -0.124334 -0.158804 -0.152727 -0.214741 -0.228183 -0.211207 -0.220281 0.049607 0.305144 0.312534 0.048232 0.138536 0.126940 0.119219 0.117196 0.105845 0.138227 0.140029 0.136767 0.139204 0.151063 0.149887 0.150423 0.150023 0.176248 0.159392
qa: 0.5065 -0.2205 -0.2217 0.1111 -0.3325 -0.4117 -0.1842 -0.1162 -0.0720 -0.3992 -0.1638 -0.1243 -0.1588 -0.1527 -0.2147 -0.2282 -0.2112 -0.2203 0.0496 0.3051 0.3125 0.0482 0.1385 0.1269 0.1192 0.1172 0.1058 0.1382 0.1400 0.1368 0.1392 0.1511 0.1499 0.1504 0.1500 0.1762 0.1594
va: 4.0767 1.0586 1.0571 3.3937 2.8785 3.0284 3.7966 3.7635 3.6763 3.8979 3.8688 3.8048 3.8697 3.8652 3.9158 3.9388 3.9159 3.9211 4.0506 3.8922 3.8885 4.0543 0.9969 1.0103 1.0080 1.0068 1.0104 1.0006 0.9906 0.9998 0.9956 0.9976 0.9981 0.9986 0.9973 0.9904 0.9969
dispcorr: -0.018570254 hartree
energy: -1272.320090137708
dipole: -0.37384 1.98134 1.60750 10.66387 -10.17549 0.48838 7.03106 -6.20743 0.82362
magnitude: 1.87108 au
magnitude: 4.75591 debye
