program: Orca
programVersion: 4.2.1
elementType: Si F F N N N C C C C C C C C C C C C C C C C H H H H H H H H H H H H H H H
charge: 0
multiplicity: 1
keywords: wb97x-d3
keywords: def2-TZVPP
keywords: def2/J RIJCOSX GRIDX6 NOFINALGRIDX
keywords: grid4 nofinalgrid
keywords: scfconv7
keywords: smallprint printgap noloewdin
keywords: NOSOSCF
formula: C16H15F2N3Si
InChI: InChI=1S/C16H15F2N3Si/c1-22(12-21-11-19-10-20-21,15-6-2-13(17)3-7-15)16-8-4-14(18)5-9-16/h2-11H,12H2,1H3
37 atoms
Si -0.626623 0.377316 0.836233
F  4.912801 -0.261428 -1.331317
F  -3.882092 -4.645983 0.57066
N  -0.434442 2.664939 -0.724509
N  0.267063 2.490854 -1.842334
N  0.996792 4.297838 -0.742772
C  -1.423807 1.69252 -0.306449
C  1.115545 0.093218 0.216129
C  -1.641254 -1.195033 0.728106
C  -0.602164 1.052898 2.584215
C  1.366393 -0.70501 -0.902334
C  -2.990888 -1.164041 0.369597
C  2.194776 0.762382 0.795112
C  -1.077786 -2.436328 1.035244
C  2.641657 -0.837688 -1.429077
C  -3.756943 -2.319584 0.313701
C  3.479418 0.652961 0.281767
C  -1.822521 -3.605561 0.986291
C  0.014413 3.737824 -0.072095
C  3.675203 -0.147098 -0.82548
C  -3.152896 -3.521745 0.624049
C  1.110443 3.493789 -1.81441
H  -1.842954 1.247516 -1.208886
H  -2.237745 2.219052 0.194929
H  -1.620696 1.206351 2.947462
H  -0.112203 0.361454 3.272601
H  -0.085745 2.011916 2.660921
H  0.556606 -1.23965 -1.385421
H  -3.475856 -0.226775 0.122715
H  2.050445 1.389097 1.666935
H  -0.033612 -2.509156 1.316773
H  2.827762 -1.460193 -2.294701
H  -4.801217 -2.284013 0.031562
H  4.309378 1.178858 0.735706
H  -1.375962 -4.562459 1.223855
H  -0.405827 4.077221 0.862111
H  1.830841 3.651297 -2.602274
elementType: Si F N C H
totalener: -1272.30077698 hartree
nucrepener: 1874.41378164 hartree
electener: -3146.71455862 hartree
oneelecener: -5467.02635494 hartree
twoeener: 2320.31179632 hartree
cpcmener: -0.02718505 hartree
kineticenergy: 1267.68473895 hartree
xcener: -108.334498310883 hartree
chargesum: -0.0000000
charge: 0.489771 -0.221951 -0.220663 0.116377 -0.325056 -0.410781 -0.190908 -0.087798 -0.105108 -0.382933 -0.136472 -0.164588 -0.122994 -0.154667 -0.225402 -0.211977 -0.226888 -0.218208 0.035483 0.315233 0.304111 0.051480 0.129731 0.139510 0.115448 0.118908 0.099183 0.137032 0.136470 0.142150 0.138994 0.150075 0.150559 0.149230 0.151752 0.176915 0.157979
qa: 0.4898 -0.2220 -0.2207 0.1164 -0.3251 -0.4108 -0.1909 -0.0878 -0.1051 -0.3829 -0.1365 -0.1646 -0.1230 -0.1547 -0.2254 -0.2120 -0.2269 -0.2182 0.0355 0.3152 0.3041 0.0515 0.1297 0.1395 0.1154 0.1189 0.0992 0.1370 0.1365 0.1422 0.1390 0.1501 0.1506 0.1492 0.1518 0.1769 0.1580
va: 4.0670 1.0568 1.0583 3.3968 2.8853 3.0220 3.7815 3.7110 3.7489 3.8956 3.8455 3.8748 3.7975 3.8620 3.9274 3.9136 3.9379 3.9193 4.0662 3.8839 3.8925 4.0497 1.0102 0.9967 1.0089 1.0059 1.0122 0.9948 0.9990 0.9899 1.0003 0.9971 0.9984 0.9979 0.9971 0.9907 0.9974
dispcorr: -0.018961555 hartree
energy: -1272.319738534551
dipole: -5.00798 3.54948 -1.45850 9.26806 -9.57903 -0.31097 7.66570 -6.38524 1.28046
magnitude: 1.96558 au
magnitude: 4.99612 debye
