program: Orca
programVersion: 4.2.1
elementType: Si F F N N N C C C C C C C C C C C C C C C C H H H H H H H H H H H H H H H
charge: 0
multiplicity: 1
keywords: wb97x-d3
keywords: def2-TZVPP
keywords: def2/J RIJCOSX GRIDX6 NOFINALGRIDX
keywords: grid4 nofinalgrid
keywords: scfconv7
keywords: smallprint printgap noloewdin
keywords: NOSOSCF
formula: C16H15F2N3Si
InChI: InChI=1S/C16H15F2N3Si/c1-22(12-21-11-19-10-20-21,15-6-2-13(17)3-7-15)16-8-4-14(18)5-9-16/h2-11H,12H2,1H3
37 atoms
Si -0.504284 0.312461 0.464759
F  5.316425 -0.252172 -0.822166
F  -3.358948 -4.952499 0.318955
N  -0.76645 2.761734 -0.803308
N  -1.493956 3.664406 -0.14308
N  0.46074 4.556702 -0.780337
C  -1.224065 1.39608 -0.934435
C  1.321833 0.10737 0.100918
C  -1.374986 -1.346709 0.400555
C  -0.779756 1.184581 2.099438
C  1.740144 -0.512921 -1.080286
C  -0.676731 -2.555053 0.409158
C  2.307067 0.603187 0.954907
C  -2.770934 -1.405496 0.370919
C  3.081368 -0.640985 -1.401937
C  -1.334431 -3.775872 0.382514
C  3.656585 0.487293 0.655159
C  -3.450213 -2.612481 0.343709
C  0.40251 3.30508 -1.167693
C  4.020906 -0.135005 -0.522247
C  -2.714814 -3.782833 0.348243
C  -0.72057 4.725897 -0.157469
H  -0.934013 1.014084 -1.915403
H  -2.313616 1.417748 -0.918354
H  -1.840406 1.385515 2.254379
H  -0.435226 0.575652 2.936225
H  -0.267287 2.146356 2.141165
H  1.007395 -0.917168 -1.77055
H  0.406123 -2.554215 0.438857
H  2.028125 1.096033 1.878042
H  -3.356944 -0.492958 0.373158
H  3.397097 -1.124026 -2.3170
H  -0.785723 -4.708192 0.389153
H  4.414459 0.876727 1.321533
H  -4.531088 -2.648767 0.320118
H  1.165093 2.761637 -1.704653
H  -1.026665 5.65692 0.293298
totalener: -1272.27944411 hartree
nucrepener: 1850.20730403 hartree
electener: -3122.48674813 hartree
oneelecener: -5417.95929439 hartree
twoeener: 2295.47254625 hartree
kineticenergy: 1267.68029566 hartree
xcener: -108.331552430841 hartree
chargesum: -0.0000000
charge: 0.467481 -0.196568 -0.198414 0.114266 -0.313981 -0.335497 -0.208566 -0.124930 -0.071785 -0.382796 -0.173179 -0.115291 -0.055026 -0.147407 -0.194170 -0.196801 -0.195199 -0.199239 0.038980 0.296110 0.290575 0.057632 0.116815 0.120154 0.112124 0.111814 0.104352 0.126186 0.132186 0.124273 0.111144 0.129857 0.127197 0.127706 0.125602 0.142435 0.131959
qa: 0.4675 -0.1966 -0.1984 0.1143 -0.3140 -0.3355 -0.2086 -0.1249 -0.0718 -0.3828 -0.1732 -0.1153 -0.0550 -0.1474 -0.1942 -0.1968 -0.1952 -0.1992 0.0390 0.2961 0.2906 0.0576 0.1168 0.1202 0.1121 0.1118 0.1044 0.1262 0.1322 0.1243 0.1111 0.1299 0.1272 0.1277 0.1256 0.1424 0.1320
va: 4.1055 1.0943 1.0918 3.3376 2.8553 3.0606 3.8225 3.7451 3.7900 3.9289 3.8676 3.8590 3.8193 3.9290 3.9566 3.9468 3.9528 3.9627 4.0689 3.9663 3.9714 4.0496 1.0059 1.0230 1.0165 1.0086 1.0102 1.0007 0.9958 0.9972 1.0046 1.0048 1.0060 1.0061 1.0070 0.9993 1.0017
dispcorr: -0.018234656 hartree
energy: -1272.297678761834
dipole: -5.16192 4.98292 -0.17900 8.73683 -9.68116 -0.94432 4.20280 -4.15366 0.04914
magnitude: 0.96240 au
magnitude: 2.44621 debye
