program: Orca
programVersion: 4.2.1
elementType: Si F F N N N C C C C C C C C C C C C C C C C H H H H H H H H H H H H H H H
charge: 0
multiplicity: 1
keywords: wb97x-d3
keywords: def2-TZVPP
keywords: def2/J RIJCOSX GRIDX6 NOFINALGRIDX
keywords: grid4 nofinalgrid
keywords: scfconv7
keywords: smallprint printgap noloewdin
keywords: NOSOSCF
formula: C16H15F2N3Si
InChI: InChI=1S/C16H15F2N3Si/c1-22(12-21-11-19-10-20-21,15-6-2-13(17)3-7-15)16-8-4-14(18)5-9-16/h2-11H,12H2,1H3
37 atoms
Si 0.165445 0.312717 1.456635
F  5.274847 -0.460696 -1.577346
F  -4.160105 -3.353203 -0.454248
N  -0.844245 2.356382 -0.17152
N  -2.139662 2.481945 -0.462196
N  -0.91158 2.581617 -2.334145
C  -0.406085 2.116891 1.186286
C  1.747344 0.063812 0.478904
C  -1.165749 -0.851238 0.853799
C  0.492696 0.096481 3.294106
C  1.948497 -1.050474 -0.33639
C  -1.846946 -1.687722 1.739258
C  2.788938 0.990614 0.57644
C  -1.536473 -0.893099 -0.494333
C  3.133135 -1.237864 -1.033409
C  -2.857116 -2.535934 1.311024
C  3.980226 0.827168 -0.11139
C  -2.542462 -1.731387 -0.944367
C  -0.122063 2.413082 -1.300193
C  4.131099 -0.291816 -0.909702
C  -3.189029 -2.540757 -0.02916
C  -2.133499 2.615922 -1.768135
H  -1.255884 2.337455 1.831534
H  0.377073 2.833872 1.446792
H  -0.390922 0.299829 3.90088
H  0.829194 -0.916306 3.519418
H  1.280411 0.773333 3.629125
H  1.168304 -1.795071 -0.436889
H  -1.593628 -1.688721 2.792535
H  2.681723 1.869711 1.203189
H  -1.033161 -0.268821 -1.223585
H  3.279861 -2.10408 -1.664711
H  -3.37971 -3.181702 2.004064
H  4.780364 1.550892 -0.031365
H  -2.824489 -1.754271 -1.988412
H  0.953954 2.329296 -1.320369
H  -3.045606 2.746326 -2.329034
totalener: -1272.27827428 hartree
nucrepener: 1887.14095676 hartree
electener: -3159.41923105 hartree
oneelecener: -5491.98248555 hartree
twoeener: 2332.56325450 hartree
kineticenergy: 1267.67038336 hartree
xcener: -108.331407980648 hartree
chargesum: 0.0000000
charge: 0.401628 -0.196989 -0.198853 0.118949 -0.295076 -0.330656 -0.189036 -0.076713 -0.054357 -0.413382 -0.069602 -0.086592 -0.152358 -0.161758 -0.199412 -0.203358 -0.190516 -0.209951 0.015588 0.296181 0.302075 0.051414 0.121421 0.117632 0.102377 0.106995 0.101277 0.132490 0.119823 0.110793 0.145564 0.127873 0.124197 0.127661 0.126692 0.147817 0.130162
qa: 0.4016 -0.1970 -0.1989 0.1189 -0.2951 -0.3307 -0.1890 -0.0767 -0.0544 -0.4134 -0.0696 -0.0866 -0.1524 -0.1618 -0.1994 -0.2034 -0.1905 -0.2100 0.0156 0.2962 0.3021 0.0514 0.1214 0.1176 0.1024 0.1070 0.1013 0.1325 0.1198 0.1108 0.1456 0.1279 0.1242 0.1277 0.1267 0.1478 0.1302
va: 4.1515 1.0940 1.0918 3.3289 2.8458 3.0463 3.7966 3.7022 3.7564 3.9360 3.8332 3.8606 3.8578 3.8531 3.9559 3.9591 3.9589 3.9824 4.0702 3.9700 3.9627 4.0442 1.0246 1.0003 1.0107 1.0113 1.0155 0.9968 0.9955 1.0030 0.9857 1.0057 1.0072 1.0053 1.0067 1.0003 1.0037
dispcorr: -0.019236077 hartree
energy: -1272.297510359158
dipole: 0.56585 0.13160 0.69745 6.44288 -6.58825 -0.14537 12.32487 -10.86727 1.45759
magnitude: 1.62239 au
magnitude: 4.12379 debye
