program: Gaussian 09
title: 000030299
version: EM64L-G09RevD.01
frameworkgroup: C1[X(C17H27NO2)]
method: RPBEPBE
basis: SDD
operation: Freq
keyword: #p
keyword: freq=noraman
keyword: PBEPBE/SDD
title: #p freq=noraman PBEPBE/SDD
converged: YES YES NO NO
title: Mulliken charges:
elementType: O O N C C C C C C C C C C C C C C C C C H H H H H H H H H H H H H H H H H H H H H H H H H H H
charge: -0.257385 -0.231462 -0.111108 -0.403391 -0.037760 -0.520293 -0.329263 -0.325856 -0.298498 0.101922 -0.713994 -0.715287 0.297753 -0.668784 -0.670401 0.350776 -0.348555 -0.339976 -0.366023 -0.379409 0.224832 0.218803 0.229254 0.221144 0.232620 0.205906 0.194644 0.206491 0.192230 0.210267 0.228665 0.254160 0.209516 0.191300 0.209636 0.219171 0.200653 0.209507 0.224420 0.209793 0.209597 0.226790 0.210440 0.242649 0.279290 0.251305 0.253914
chargesum: 0.00000
title: Mulliken charges with hydrogens summed into heavy atoms:
elementType: O O N C C C C C C C C C C C C C C C C C
charge: -0.257385 -0.231462 -0.111108 0.040245 0.191494 -0.066530 0.071287 0.072866 0.140435 0.101922 -0.059019 -0.085828 0.297753 -0.025064 -0.023574 0.350776 -0.105906 -0.060687 -0.114718 -0.125495
polarizability: 3.08110747e+02 1.95416858e-01 1.83433141e+02 6.01616591e-01 8.82861244e+00 1.45211626e+02
1716.lowfreq: -7.5823 -2.9427 -0.6236 0.0002 0.0006 0.0010 19.0581 19.6515 32.0843
frequency: 18.8799 19.5434 32.0420 34.4716 51.5364 59.0033 72.6125 84.3318 96.6499 110.7020 121.0624 152.6405 164.0907 178.2246 204.9624 213.0252 224.2829 242.6310 262.5351 274.6226 283.2622 297.4610 318.6728 343.9704 379.6500 387.2849 413.7783 418.7340 442.8805 467.1756 487.4730 489.7375 502.7763 573.2605 617.1704 630.2020 733.0875 736.1346 765.0266 792.9908 794.8731 801.6864 815.3605 824.3674 828.1613 850.8450 890.8640 915.4494 916.0996 941.2576 952.6936 960.9987 964.9568 991.0027 996.3705 997.9120 1011.2918 1062.1091 1063.2335 1076.3453 1085.2325 1095.3453 1098.0854 1115.6478 1123.4023 1132.6915 1163.4057 1178.4787 1182.4296 1206.8248 1222.4063 1224.4580 1234.2894 1237.3568 1280.9028 1287.8255 1289.3705 1292.6879 1301.8869 1326.8432 1329.1921 1347.6981 1362.3831 1367.3409 1375.3058 1375.8381 1388.1294 1388.8054 1392.0151 1392.8561 1429.5388 1430.2873 1461.5435 1463.1933 1466.3181 1469.4662 1470.5448 1471.2991 1479.9094 1480.8057 1485.6455 1486.5039 1491.1833 1491.5254 1497.7500 1554.2958 1589.9798 1618.7449 2859.1901 2867.3530 2917.1909 2951.7631 2963.1013 2969.8031 2970.8074 2982.6038 2985.3817 2996.1785 3012.7654 3019.1620 3036.9311 3037.9931 3054.2165 3062.6188 3066.9202 3068.0614 3075.9586 3078.8328 3089.8984 3091.6762 3091.9313 3142.3442 3150.3884 3166.3959 3171.2555
redmass: 3.5233 3.4280 3.2712 3.7231 3.0515 4.0355 2.7856 2.0790 2.8845 3.0054 4.6898 2.8685 2.9961 1.6889 1.0635 1.7894 1.4495 1.2338 2.6523 2.0231 5.3476 2.2734 2.6817 2.9043 3.0568 2.7486 2.9598 2.3679 2.8109 3.1952 3.4318 3.1786 3.6889 2.4324 6.5094 6.8758 3.6018 3.4822 3.4809 1.2569 1.1345 1.4497 2.2603 1.8602 2.1090 1.4693 1.7684 1.8379 1.2098 2.1696 1.3836 2.2053 3.0950 2.2630 2.8827 1.3705 2.0665 2.2076 1.9166 1.9209 2.1335 2.8658 1.6433 1.3200 1.7222 2.1823 1.4129 1.2999 1.8519 2.2533 1.5635 1.7284 2.3405 1.9270 1.1216 1.2501 1.7720 1.2188 1.3055 1.5779 1.3329 1.5955 1.3424 1.4110 1.5105 2.2198 1.2344 1.2571 1.4099 1.2838 1.2206 3.0587 1.0661 1.0546 1.0559 1.0802 1.0519 1.0721 1.0591 1.0557 1.0774 1.0809 1.0834 1.0486 2.3468 7.2121 8.2445 6.3865 1.0717 1.0714 1.0703 1.0602 1.0359 1.0387 1.0562 1.0358 1.0357 1.0873 1.0931 1.0880 1.0941 1.0951 1.0988 1.0987 1.0962 1.0984 1.0982 1.0983 1.0987 1.1004 1.1004 1.0877 1.0879 1.0952 1.0972
irintensity: 0.0242 1.1425 0.0131 0.1852 0.0410 0.1154 0.0656 0.1434 2.0153 1.3068 0.5959 3.4148 0.7619 2.5857 0.1461 3.3223 0.5667 1.5996 5.3261 1.4933 0.8990 4.0630 0.6114 3.3278 9.5899 0.4812 0.0617 0.7204 2.5777 2.5898 4.0530 5.1249 10.4823 13.1587 32.7578 8.4749 3.9399 0.3501 2.7140 12.2308 3.7322 20.6165 12.6797 6.1494 8.1994 48.7180 14.4207 0.4600 9.6701 68.4877 0.4088 69.6866 57.5526 7.7399 7.2133 0.6638 8.0162 37.3161 29.7676 19.3818 2.7545 12.6695 5.0056 24.1677 7.4533 18.7678 18.6900 230.4200 51.8900 40.6069 98.4565 58.4807 149.6787 91.7370 0.4925 47.0328 98.8672 24.3014 3.6722 32.2206 1.3673 46.4188 1.6952 5.1068 18.6406 16.4027 20.0412 19.1135 8.7968 8.7028 33.0542 32.1148 3.8426 9.1940 8.4966 6.5698 8.0044 13.9637 13.1418 5.2593 12.2243 20.5470 6.9913 28.6192 31.0290 206.6315 102.3305 182.1781 32.2278 175.9315 68.5861 35.2949 37.6940 31.6613 37.0589 29.7599 29.7817 0.7195 14.6151 22.6451 17.9463 12.2908 18.8932 52.6043 38.7399 88.9921 56.6888 66.3993 30.8201 26.0133 60.1092 12.7277 0.1741 13.0692 6.8835
temp: 298.150 k
press: 1.00000 atm
elementType: 8 8 7 6 6 6 6 6 6 6 6 6 6 6 6 6 6 6 6 6 1 1 1 1 1 1 1 1 1 1 1 1 1 1 1 1 1 1 1 1 1 1 1 1 1 1 1
symmnumber: 1
zpe: 1063915.9 jmol-1
zpe.correction: 0.405224 hartree
zpe.thermalcorrener: 0.428284 hartree
zpe.thermalcorrenthalpy: 0.429228 hartree
zpe.thermalcorrgfe: 0.349742 hartree
zpe.sumelectzpe: -867.619481 hartree
zpe.sumelectthermal: -867.596422 hartree
zpe.sumelectthermalent: -867.595477 hartree
zpe.sumelectthermalfe: -867.674963 hartree
dipole: -4.7982 2.9040 0.3937
dipole: 5.6224
quadrupole: -121.8783 -124.3747 -123.8565
quadrupole: 10.6900 4.4734 -0.2368
quadrupole: 1.4916 -1.0049 -0.4867 10.6900 4.4734 -0.2368
hfenergy: -868.0247051 hartree
pointgroup: C01 [X(C17H27N1O2)]
dipole: 1.8804753 1.1027647 -0.3751604 debye
polarizability: 308.017468|-0.7854819|180.0120903|-3.8781782|-14.0217194|148.7259554 unknown
InChI: InChI=1S/C17H27NO2/c1-5-18(6-2)11-12-20-16-9-7-15(8-10-16)17(19)13-14(3)4/h7-10,14H,5-6,11-13H2,1-4H3
charge 0 multiplicity 1
47 atoms
O  1.811157 -1.203435 0.593456
O  -4.595238 -1.571277 0.666961
N  5.163198 0.323482 -0.02925
C  4.162646 -0.700672 0.359113
C  -6.060186 0.728208 -0.171565
C  -4.523343 0.657138 -0.333219
C  5.471315 1.271178 1.077676
C  6.376182 -0.248532 -0.673558
C  2.74687 -0.173846 0.091995
C  -3.879184 -0.605673 0.258369
C  -6.456323 0.971747 1.303916
C  -6.645632 1.823718 -1.092323
C  -2.385293 -0.693427 0.319072
C  5.957513 2.64501 0.578467
C  6.122036 -0.710977 -2.120666
C  0.441797 -0.970189 0.46902
C  -1.527142 0.327214 -0.167859
C  -1.792653 -1.861856 0.883131
C  -0.124895 0.199866 -0.100901
C  -0.402163 -2.002674 0.961591
H  4.31336 -1.616652 -0.238096
H  4.246747 -0.998844 1.429711
H  -6.472435 -0.254676 -0.472562
H  -4.058683 1.557704 0.118659
H  -4.256439 0.688614 -1.411867
H  4.543867 1.417559 1.663107
H  6.221923 0.837124 1.785775
H  7.151399 0.538644 -0.687825
H  6.79546 -1.094385 -0.0725
H  2.569068 0.782059 0.624948
H  2.595495 -0.014225 -0.992853
H  -6.068386 0.168429 1.953046
H  -7.556255 0.997152 1.415324
H  -6.058361 1.941286 1.664181
H  -6.408264 1.629994 -2.155913
H  -7.745864 1.873009 -0.994326
H  -6.241621 2.82135 -0.830015
H  6.149954 3.320006 1.43316
H  5.194795 3.105582 -0.073346
H  6.894959 2.565288 -0.000838
H  7.050118 -1.115148 -2.566238
H  5.77378 0.137464 -2.735015
H  5.355261 -1.505485 -2.170613
H  -1.947265 1.235711 -0.611708
H  -2.460855 -2.646406 1.252946
H  0.509652 1.001732 -0.488556
H  0.061227 -2.894186 1.394886
