program: Orca
programVersion: 4.2.1
elementType: Si F F N N N C C C C C C C C C C C C C C C C H H H H H H H H H H H H H H H
charge: 0
multiplicity: 1
keywords: wb97x-d3
keywords: def2-TZVPP
keywords: def2/J RIJCOSX GRIDX6 NOFINALGRIDX
keywords: grid4 nofinalgrid
keywords: scfconv7
keywords: smallprint printgap noloewdin
keywords: NOSOSCF
formula: C16H15F2N3Si
InChI: InChI=1S/C16H15F2N3Si/c1-22(12-21-11-19-10-20-21,15-6-2-13(17)3-7-15)16-8-4-14(18)5-9-16/h2-11H,12H2,1H3
37 atoms
Si -0.052163 0.278755 1.347321
F  5.104487 -0.427491 -1.60804
F  -4.069014 -3.890723 -0.189377
N  -0.702001 2.584054 -0.159206
N  -0.782516 1.761482 -1.20453
N  -0.696933 3.884197 -1.903378
C  -0.694955 2.075569 1.189915
C  1.534491 0.080052 0.377455
C  -1.320428 -1.00566 0.846624
C  0.304763 0.099633 3.189687
C  1.928967 -1.174836 -0.088064
C  -2.030798 -1.711482 1.819434
C  2.391271 1.156662 0.144381
C  -1.574571 -1.314068 -0.49314
C  3.129941 -1.358465 -0.75682
C  -2.962893 -2.682658 1.484247
C  3.595392 0.99876 -0.522729
C  -2.495364 -2.285008 -0.850612
C  -0.65381 3.849697 -0.595044
C  3.945811 -0.263588 -0.961925
C  -3.178187 -2.953594 0.148026
C  -0.778626 2.580245 -2.229467
H  -1.703089 2.121442 1.613076
H  -0.070343 2.729198 1.803626
H  1.108354 0.77468 3.488165
H  -0.559755 0.324469 3.816949
H  0.633661 -0.912135 3.430077
H  1.288527 -2.035446 0.065663
H  -1.860901 -1.513672 2.870748
H  2.125574 2.152837 0.47878
H  -1.051743 -0.777419 -1.272712
H  3.428069 -2.334342 -1.116137
H  -3.50949 -3.223156 2.245292
H  4.250848 1.83982 -0.704862
H  -2.685918 -2.519078 -1.889541
H  -0.586938 4.699505 0.067182
H  -0.830107 2.222778 -3.245591
totalener: -1272.27873358 hartree
nucrepener: 1873.95187554 hartree
electener: -3146.23060911 hartree
oneelecener: -5466.08248985 hartree
twoeener: 2319.85188073 hartree
kineticenergy: 1267.68207960 hartree
xcener: -108.336210376970 hartree
chargesum: -0.0000000
charge: 0.423951 -0.201255 -0.200821 0.111269 -0.310579 -0.334073 -0.232712 0.017157 -0.081913 -0.416025 -0.119830 -0.099126 -0.124088 -0.120881 -0.198989 -0.208219 -0.193939 -0.193173 0.039896 0.287801 0.293381 0.077872 0.123304 0.115332 0.104257 0.093929 0.107630 0.122151 0.121591 0.099056 0.135045 0.125161 0.123165 0.123300 0.125057 0.139570 0.125746
qa: 0.4240 -0.2013 -0.2008 0.1113 -0.3106 -0.3341 -0.2327 0.0172 -0.0819 -0.4160 -0.1198 -0.0991 -0.1241 -0.1209 -0.1990 -0.2082 -0.1939 -0.1932 0.0399 0.2878 0.2934 0.0779 0.1233 0.1153 0.1043 0.0939 0.1076 0.1222 0.1216 0.0991 0.1350 0.1252 0.1232 0.1233 0.1251 0.1396 0.1257
va: 4.1475 1.0877 1.0883 3.3296 2.8467 3.0674 3.7926 3.7271 3.7676 3.9191 3.8921 3.8554 3.8776 3.8634 3.9475 3.9651 3.9562 3.9369 4.0649 3.9698 3.9665 4.0504 0.9984 0.9989 1.0142 1.0117 1.0115 1.0002 0.9960 1.0019 1.0158 1.0055 1.0078 1.0062 1.0056 1.0010 1.0034
dispcorr: -0.018328448 hartree
energy: -1272.297062024797
dipole: -1.04171 1.01737 -0.02434 7.44944 -7.24919 0.20026 12.41888 -11.01070 1.40819
magnitude: 1.42256 au
magnitude: 3.61586 debye
