program: Gaussian 09
title: 000030312
version: EM64L-G09RevD.01
frameworkgroup: C1[X(C15H21NO4)]
method: RPBEPBE
basis: SDD
operation: Freq
keyword: #p
keyword: freq=noraman
keyword: PBEPBE/SDD
title: #p freq=noraman PBEPBE/SDD
converged: YES YES NO NO
title: Mulliken charges:
elementType: O O O O N C C C C C C C C C C C C C C C H H H H H H H H H H H H H H H H H H H H H
charge: -0.250772 -0.237945 -0.260474 -0.220605 -0.098867 -0.353376 -0.383509 -0.369615 -0.311440 -0.327236 -0.270587 0.277275 0.190143 -0.510805 -0.311291 0.344185 -0.405584 0.115473 -0.793422 -0.534167 0.188459 0.201015 0.322328 0.178131 0.194712 0.208367 0.207458 0.187295 0.190077 0.217130 0.225633 0.196586 0.277773 0.243103 0.245397 0.233093 0.235320 0.260845 0.225077 0.226098 0.248722
chargesum: 0.00000
title: Mulliken charges with hydrogens summed into heavy atoms:
elementType: O O O O N C C C C C C C C C C C C C C C
charge: -0.250772 -0.237945 -0.260474 -0.220605 -0.098867 0.036098 0.116950 0.033464 0.083312 0.079971 0.151632 0.277275 0.190143 -0.233032 -0.068187 0.344185 -0.160187 0.115473 -0.064164 0.165731
polarizability: 2.51966910e+02 -1.45062911e+01 2.06592010e+02 -1.46932790e+01 -1.58159121e+00 1.19973694e+02
1716.lowfreq: -9.4648 -2.4443 -0.0004 -0.0002 0.0005 6.7920 18.6208 26.9245 51.2527
frequency: 17.3112 26.8566 51.2366 58.3200 72.9728 83.3617 100.8038 115.9522 139.2906 162.9355 163.9155 212.8980 220.7594 233.8422 249.3380 257.4338 265.4261 292.7673 323.9223 335.3751 345.3912 386.8945 412.7392 440.3807 458.3112 468.4646 501.3118 508.9901 566.8509 576.4460 582.9134 592.9742 638.0417 670.3847 722.6246 731.9209 739.1498 793.9666 802.1362 832.1464 841.7348 856.0634 893.8548 922.2061 935.6448 944.1856 951.5695 999.1916 1013.0543 1018.8303 1024.8320 1028.1613 1052.2601 1054.5700 1079.6899 1083.3579 1106.1422 1112.3627 1139.5200 1145.7999 1148.0901 1153.8898 1187.1549 1189.3634 1220.7241 1242.7347 1251.3471 1259.5973 1269.1523 1283.6080 1294.7584 1304.7075 1331.3317 1340.4942 1360.1993 1366.0959 1366.7888 1378.0042 1391.9942 1394.6016 1414.8919 1435.9540 1441.2935 1443.0459 1449.4534 1450.6502 1452.6306 1457.4333 1466.5430 1467.9763 1471.9589 1475.3294 1492.1031 1552.0157 1591.0958 1617.0570 2856.3355 2864.3112 2896.7209 2944.8845 2954.9908 2959.0943 2968.1303 2983.9748 3013.8290 3019.0348 3038.9603 3059.5496 3072.0800 3072.6400 3076.6403 3088.3761 3122.1958 3130.7950 3154.5393 3177.1374 3185.5013
redmass: 4.2941 3.6058 5.9861 4.1431 3.9517 3.9112 4.4196 5.1745 3.3598 1.6294 1.6299 1.4945 2.3187 4.0254 2.0256 3.5781 2.7861 3.8795 5.4536 2.0345 3.9743 2.7311 2.6755 4.6221 3.0876 2.7655 3.2996 4.0768 3.3974 4.2421 1.9568 3.9950 3.2956 4.9683 4.9847 2.7073 2.9388 1.4800 4.0696 3.2858 1.6328 1.7879 3.0457 3.2563 1.3595 2.2467 3.0805 2.9225 3.7960 1.7965 2.1232 2.2389 1.9673 2.5021 2.2278 3.6899 2.2690 1.2581 2.1005 1.5819 1.9917 2.5749 1.6711 1.0725 1.1611 1.2038 3.1607 4.0446 1.2621 1.5973 1.2326 1.3042 1.2901 1.2668 1.4646 1.2756 1.2776 1.4482 1.7616 2.5932 3.3302 1.1941 1.0843 1.0859 1.1011 1.1040 1.1612 1.0971 1.0528 1.0500 1.0634 1.0940 2.7154 6.2748 8.1864 6.4637 1.0701 1.0694 1.0686 1.0665 1.0580 1.0672 1.0325 1.0378 1.0907 1.0890 1.1048 1.1043 1.0963 1.0967 1.0909 1.0969 1.0994 1.1001 1.0869 1.0954 1.0909
irintensity: 0.7697 0.8572 3.4031 1.1834 3.1950 2.6857 1.9240 1.6488 0.7221 1.0886 0.3891 1.8831 2.2032 3.6740 3.0260 9.0006 9.4503 0.7968 1.9303 4.0954 4.4303 0.6962 2.3550 0.6503 3.8843 0.7434 6.6007 10.2838 8.0668 13.3937 9.4963 17.1052 8.1253 1.7921 2.1038 6.9163 0.9404 33.8133 26.3859 4.3993 0.7806 42.7436 11.6981 54.2967 1.0640 24.9437 23.3967 22.1466 68.4282 2.7090 3.2505 11.7651 27.2655 57.8738 6.5922 53.5255 1.1654 0.1556 213.0765 10.6624 93.4653 17.9649 92.7190 0.9644 5.2446 17.2798 135.9370 246.7678 6.1156 9.2502 24.4971 13.4362 14.7099 14.5458 19.1565 16.7821 37.6925 4.1531 6.5432 6.7954 44.5064 14.9936 3.2371 4.9775 11.7260 55.1024 8.5967 15.5217 16.3243 15.3797 39.4683 14.0538 41.6901 239.4632 155.8237 384.0728 46.7944 118.8318 93.6510 59.4200 38.4315 87.8910 69.8708 6.3851 13.4253 73.4308 36.2599 42.7241 52.5634 16.1380 39.2003 30.2444 15.0752 21.4279 5.3711 12.2082 1.0523
temp: 298.150 k
press: 1.00000 atm
elementType: 8 8 8 8 7 6 6 6 6 6 6 6 6 6 6 6 6 6 6 6 1 1 1 1 1 1 1 1 1 1 1 1 1 1 1 1 1 1 1 1 1
symmnumber: 1
zpe: 887710.3 jmol-1
zpe.correction: 0.338111 hartree
zpe.thermalcorrener: 0.358254 hartree
zpe.thermalcorrenthalpy: 0.359198 hartree
zpe.thermalcorrgfe: 0.287762 hartree
zpe.sumelectzpe: -938.247564 hartree
zpe.sumelectthermal: -938.227421 hartree
zpe.sumelectthermalent: -938.226476 hartree
zpe.sumelectthermalfe: -938.297912 hartree
dipole: 6.6605 -2.6166 0.7074
dipole: 7.1909
quadrupole: -105.6406 -110.7167 -119.7186
quadrupole: 11.5417 -10.2399 -1.8484
quadrupole: 6.3847 1.3086 -7.6933 11.5417 -10.2399 -1.8484
hfenergy: -938.5856749 hartree
pointgroup: C01 [X(C15H21N1O4)]
dipole: 2.7955813 -0.4294402 0.0655591 debye
polarizability: 256.1418694|5.7652028|185.3706131|-12.7640312|33.7725355|137.0201317 unknown
InChI: InChI=1S/C15H21NO4/c1-12(17)14-4-3-13(18-2)11-15(14)20-10-7-16-5-8-19-9-6-16/h3-4,11H,5-10H2,1-2H3
charge 0 multiplicity 1
41 atoms
O  -5.256677 -0.238418 -1.524709
O  -0.099113 -0.438054 0.327007
O  4.516037 -0.650728 -1.037499
O  -1.024709 1.965394 1.220239
N  -2.733869 -1.483041 -0.788905
C  -3.918132 -2.301818 -1.153784
C  -3.172785 -0.202262 -0.160965
C  -1.736301 -2.218209 0.015999
C  -4.812274 -1.505442 -2.121605
C  -4.077884 0.563556 -1.132826
C  -0.293676 -1.784313 -0.255721
C  1.153647 0.150915 0.232194
C  1.321019 1.463906 0.810788
C  2.248036 -0.506581 -0.372664
C  2.626597 2.022071 0.771071
C  3.522991 0.102844 -0.406147
C  3.726921 1.378664 0.176169
C  0.196817 2.25229 1.401586
C  0.54663 3.485821 2.246474
C  5.866311 -0.080435 -1.109486
H  -4.522966 -2.587361 -0.255538
H  -3.582706 -3.231858 -1.652889
H  -2.294383 0.408962 0.102885
H  -3.742973 -0.405364 0.781349
H  -1.79347 -3.29158 -0.25403
H  -1.934143 -2.14688 1.112921
H  -5.734866 -2.061916 -2.359206
H  -4.245543 -1.302902 -3.057055
H  -3.501393 0.840975 -2.041485
H  -4.485347 1.472099 -0.660538
H  -0.11233 -1.742569 -1.347218
H  0.41673 -2.491736 0.222307
H  2.149479 -1.494665 -0.826626
H  2.786312 3.011608 1.209286
H  4.705035 1.865928 0.166583
H  0.936573 4.304897 1.612501
H  1.305063 3.262246 3.01769
H  -0.376913 3.837646 2.731076
H  6.285856 0.083311 -0.09859
H  5.868697 0.870735 -1.675067
H  6.4650 -0.832433 -1.643272
