program: Gaussian 09
title: 000030445
version: EM64L-G09RevD.01
frameworkgroup: C1[X(C19H32N2)]
method: RPBEPBE
basis: SDD
operation: Freq
keyword: #pfreq=noraman
keyword: PBEPBE/SDD
title: #p freq=noraman PBEPBE/SDD
converged: NO NO NO NO
title: Mulliken charges:
elementType: N N C C C C C C C C C C C C C C C C C C C H H H H H H H H H H H H H H H H H H H H H H H H H H H H H H H H
charge: -0.362711 -0.107820 0.406640 -0.491505 -0.511228 -0.387470 -0.385937 -0.640033 -0.392413 -0.387584 0.506143 -0.360758 -0.406700 -0.401822 -0.302403 -0.296278 -0.242629 -0.245171 -0.244864 -0.689706 -0.698293 0.232415 0.183280 0.180959 0.232088 0.213289 0.184349 0.184488 0.210467 0.194650 0.223124 0.197281 0.186800 0.233890 0.208761 0.204588 0.182962 0.195857 0.230723 0.230757 0.204787 0.176105 0.205375 0.176379 0.222425 0.222596 0.226608 0.207620 0.229132 0.210817 0.210855 0.229377 0.209738
chargesum: 0.00000
title: Mulliken charges with hydrogens summed into heavy atoms:
elementType: N N C C C C C C C C C C C C C C C C C C C
charge: -0.128821 -0.107820 0.406640 -0.075810 -0.098181 0.010167 0.009017 -0.222260 -0.008332 0.025764 0.506143 0.018062 -0.175977 -0.171065 0.078490 0.085476 -0.020204 -0.022575 -0.018256 -0.042136 -0.048323
polarizability: 2.73813483e+02 1.25900266e+01 1.85579098e+02 -5.67110547e-01 1.61083310e+01 1.98547243e+02
1716.lowfreq: -22.5541 -8.3121 0.0007 0.0008 0.0010 3.7926 13.5396 15.9467 22.5346
frequency: -21.5713 15.6318 22.2601 28.1300 53.3978 64.8087 67.0354 67.8975 77.3155 109.1393 136.8729 159.0075 190.6348 209.8860 225.6543 228.6418 240.3719 257.0345 287.9276 294.5402 309.3691 350.9296 355.6292 403.2895 405.5107 412.6780 433.0590 445.0571 462.7040 489.9456 503.6275 514.2678 567.8162 598.5447 618.3712 622.7238 703.8126 705.0357 750.9483 762.5432 779.0805 796.7113 797.2207 805.4059 825.3656 838.0931 850.7772 855.7760 861.6454 910.2239 917.7131 924.9961 942.7566 948.4646 967.9518 972.8847 989.7301 990.2250 997.0782 1027.4587 1039.9861 1043.6278 1054.6432 1064.0722 1071.7082 1075.2806 1084.1940 1087.1758 1089.2575 1098.3993 1111.5094 1126.0427 1146.4040 1151.1277 1170.7121 1174.2883 1181.6944 1188.8613 1197.9004 1216.6239 1227.0569 1254.7195 1259.7182 1263.2915 1277.3234 1284.4946 1286.3305 1291.7469 1316.4212 1316.6860 1328.4345 1334.2946 1340.2441 1343.3019 1345.4559 1358.3855 1364.8387 1374.6395 1379.9159 1381.9345 1386.5642 1388.6129 1439.7807 1449.9916 1455.0119 1461.1263 1464.7811 1465.6515 1467.6561 1468.8720 1470.4669 1472.1489 1475.4550 1477.4023 1482.1989 1486.0858 1488.5319 1494.9255 1497.5281 1588.1111 1611.9766 2831.5230 2841.3975 2865.3295 2897.6446 2954.1722 2960.6392 2970.8441 2974.7944 2985.2628 2985.5216 2986.2589 2987.1837 3018.2018 3023.5859 3026.6509 3030.2591 3031.7709 3035.2082 3042.2650 3043.7310 3045.0379 3052.7827 3077.1186 3080.1018 3092.3651 3093.0061 3112.9880 3113.7130 3130.3447 3140.1506 3160.1181 3441.9798
redmass: 2.1552 3.1945 3.5081 3.6856 2.8603 1.9546 3.5558 2.1195 3.3026 2.9169 3.0939 2.0696 2.6128 1.7164 1.8538 2.9960 1.9925 2.1663 2.3672 2.4862 2.1971 2.0691 2.0182 2.5322 2.7591 2.4625 3.0133 2.8052 2.8613 2.4184 2.0712 2.4425 2.3195 2.5065 6.2100 2.7232 3.0293 1.6868 2.6361 2.0004 1.5185 1.1815 1.2173 1.1739 3.2830 2.8522 1.3645 1.7187 1.6487 1.5180 1.8460 1.5739 2.1883 1.7467 2.3327 1.3860 4.9892 1.3846 2.3223 2.1974 2.8725 2.2977 1.7689 2.4186 1.7420 1.9446 2.2649 1.5277 2.0401 1.6175 2.3847 1.7902 1.4347 1.3694 1.0575 2.7155 1.7508 1.1217 2.3255 2.4955 1.5938 1.4141 1.3486 1.3315 1.2321 1.1170 1.2222 1.3406 1.4927 1.3836 1.2968 1.4218 1.4020 1.4018 1.4002 1.4716 1.3141 1.3272 1.6454 3.7022 1.2368 1.2353 2.1672 1.0973 1.1436 1.0762 1.0864 1.1053 1.0636 1.0848 1.0577 1.0668 1.0676 1.1381 2.1778 1.1262 1.0650 1.0746 1.0800 5.9081 6.1069 1.0726 1.0719 1.0702 1.0695 1.0634 1.0626 1.0593 1.0606 1.0589 1.0374 1.0634 1.0359 1.0862 1.0973 1.0959 1.1004 1.1001 1.0870 1.0920 1.0869 1.0994 1.1015 1.0979 1.0971 1.1002 1.1003 1.0858 1.0872 1.0910 1.0959 1.1014 1.0738
irintensity: 0.4467 0.1444 0.0862 0.0571 0.0747 0.6318 0.0342 0.0935 0.1980 0.6211 1.1125 0.1406 0.8900 0.9647 0.4799 1.1670 1.4762 1.7587 1.2534 1.4468 0.5587 0.8979 1.0876 1.6997 1.3019 3.9299 3.2333 7.0503 3.5724 2.7084 3.5517 45.2460 6.5524 58.6438 0.2014 26.8246 1.0463 56.7968 4.1799 31.7209 2.1188 5.7852 6.2474 1.1922 3.1060 1.6982 0.3279 5.2481 3.7980 3.7965 1.0564 5.7799 22.8221 2.7963 1.3284 0.0578 0.0660 0.0143 6.6366 8.6866 0.1033 8.9656 13.5272 35.1590 18.8557 8.6845 11.2200 16.2474 20.6283 5.6055 7.1397 29.5039 9.2446 2.2761 0.5255 68.1844 16.8242 1.0723 44.8319 2.5012 14.9783 5.2544 3.5656 6.3869 4.1245 1.1215 20.9869 4.8821 25.7549 10.1283 0.4848 1.5028 1.1690 16.5571 4.6899 5.1320 3.7994 3.3240 5.8065 1.5839 15.9913 21.3177 6.2415 3.4788 19.4619 1.7163 4.5857 1.1716 17.1243 6.0494 3.9169 5.2156 6.6534 28.1874 19.0255 0.4856 9.5293 7.9017 12.3436 1.5563 19.0267 38.7192 134.6750 93.8063 106.3165 33.8955 37.0402 32.9910 44.9755 68.1230 54.7603 6.5129 31.5648 2.3103 19.5399 62.5687 9.3792 28.5457 23.3119 63.3958 13.6861 3.9915 126.8224 44.3580 81.6944 51.0667 33.4959 11.2790 5.2381 10.4809 46.9890 27.9973 1.8787
temp: 298.150 k
press: 1.00000 atm
elementType: 7 7 6 6 6 6 6 6 6 6 6 6 6 6 6 6 6 6 6 6 6 1 1 1 1 1 1 1 1 1 1 1 1 1 1 1 1 1 1 1 1 1 1 1 1 1 1 1 1 1 1 1 1
symmnumber: 1
zpe: 1243393.6 jmol-1
zpe.correction: 0.473584 hartree
zpe.thermalcorrener: 0.495586 hartree
zpe.thermalcorrenthalpy: 0.496531 hartree
zpe.thermalcorrgfe: 0.420191 hartree
zpe.sumelectzpe: -851.038617 hartree
zpe.sumelectthermal: -851.016614 hartree
zpe.sumelectthermalent: -851.015670 hartree
zpe.sumelectthermalfe: -851.092009 hartree
dipole: 0.7653 0.2989 0.0810
dipole: 0.8256
quadrupole: -123.7758 -137.0008 -125.3375
quadrupole: 0.8746 -0.9081 5.1738
quadrupole: 4.9289 -8.2961 3.3672 0.8746 -0.9081 5.1738
hfenergy: -851.5122004 hartree
pointgroup: C01 [X(C19H32N2)]
dipole: 0.2998108 0.120825 0.0319909 debye
polarizability: 273.4002996|14.1206753|184.8429192|-1.338174|15.4162102|199.6966054 unknown
InChI: InChI=1S/C19H32N2/c1-3-21(4-2)16-15-20-19(13-9-6-10-14-19)17-18-11-7-5-8-12-18/h5,7-8,11-12,20H,3-4,6,9-10,13-17H2,1-2H3
charge 0 multiplicity 1
53 atoms
N  0.725316 0.76901 0.586208
N  4.241181 -0.514788 -0.022619
C  -0.71074 0.618464 0.24078
C  -0.924152 0.823985 -1.288323
C  -1.483495 1.738166 0.99771
C  -0.489118 2.231094 -1.755464
C  -1.080674 3.160056 0.540154
C  -1.229025 -0.813521 0.698362
C  -1.263989 3.328423 -0.987026
C  1.738862 -0.130511 0.012319
C  -2.682431 -1.154401 0.422448
C  3.149823 0.449555 0.274713
C  -3.692488 -0.896036 1.389017
C  -3.078603 -1.750525 -0.805902
C  5.513176 -0.161665 0.665046
C  4.423877 -0.680007 -1.493793
C  -5.047604 -1.204524 1.134402
C  -4.431386 -2.061468 -1.066887
C  -5.424777 -1.786489 -0.098111
C  5.472252 -0.385996 2.189594
C  5.249008 -1.919828 -1.887933
H  -2.000745 0.683349 -1.501558
H  -0.389505 0.040849 -1.861925
H  -1.314653 1.624085 2.090134
H  -2.566623 1.587265 0.826089
H  0.594939 2.357143 -1.5685
H  -0.656956 2.334546 -2.845424
H  -1.683584 3.91212 1.08593
H  -0.018182 3.336901 0.794655
H  -1.03048 -0.877276 1.787571
H  -0.574941 -1.560515 0.207401
H  -0.925224 4.333419 -1.305035
H  -2.3435 3.256665 -1.238474
H  0.85843 0.907345 1.596265
H  1.724375 -1.171786 0.413397
H  1.5516 -0.20116 -1.074793
H  3.207162 0.715865 1.346367
H  3.264003 1.405815 -0.296309
H  -3.408678 -0.458612 2.354591
H  -2.314764 -1.980386 -1.559454
H  6.304251 -0.808984 0.248138
H  5.817582 0.895608 0.445947
H  3.418526 -0.782964 -1.939733
H  4.878687 0.239218 -1.949795
H  -5.806643 -0.998493 1.898061
H  -4.710164 -2.524138 -2.020804
H  -6.474394 -2.030545 -0.297012
H  4.793588 0.315479 2.707048
H  5.136975 -1.414767 2.408301
H  6.479891 -0.242912 2.622097
H  5.212695 -2.06619 -2.983377
H  4.834974 -2.819493 -1.399814
H  6.313448 -1.833846 -1.605878
