program: Orca
programVersion: 4.2.1
elementType: Cl N N N N C C C C C C C C C C C C C C C C C C C H H H H H H H H H H H H H H H H H
charge: 0
multiplicity: 1
keywords: wb97x-d3
keywords: def2-TZVPP
keywords: def2/J RIJCOSX GRIDX6 NOFINALGRIDX
keywords: grid4 nofinalgrid
keywords: scfconv7
keywords: smallprint printgap noloewdin
keywords: NOSOSCF
formula: C19H17ClN4
InChI: InChI=1S/C19H17ClN4/c20-18-8-6-16(7-9-18)10-11-19(12-21,13-24-15-22-14-23-24)17-4-2-1-3-5-17/h1-9,14-15H,10-11,13H2
41 atoms
Cl 5.097659 -2.637677 -0.3226
N  -3.534464 0.263405 -0.204394
N  -4.094025 0.390015 1.002875
N  -4.886365 1.949347 -0.394078
N  0.31189 -2.252656 -1.104483
C  -1.098083 -0.331049 -0.027829
C  -0.979745 -0.405045 1.51206
C  -2.538128 -0.73202 -0.485421
C  -0.736218 1.028349 -0.608175
C  0.33155 0.106629 2.113382
C  1.55814 -0.553527 1.552502
C  -0.25873 -1.382535 -0.614847
C  -1.153965 2.188046 0.041748
C  -0.050972 1.149959 -1.813219
C  2.362496 0.10199 0.626038
C  1.887865 -1.859414 1.906739
C  -0.883891 3.437361 -0.496304
C  0.221401 2.399949 -2.351169
C  -4.013888 1.204137 -1.024918
C  -0.192928 3.548726 -1.694248
C  3.452197 -0.528673 0.044343
C  2.971538 -2.506397 1.337931
C  -4.895015 1.411806 0.842193
C  3.741812 -1.834019 0.401318
H  -1.143128 -1.444297 1.807364
H  -1.803132 0.155871 1.954013
H  -2.540975 -0.899394 -1.561517
H  -2.830733 -1.663819 -0.002287
H  0.274176 -0.065966 3.190653
H  0.406047 1.187223 1.983309
H  -1.691177 2.134255 0.980509
H  0.28741 0.269807 -2.345851
H  2.136813 1.122773 0.342634
H  1.284262 -2.39127 2.6331
H  -1.216185 4.325178 0.025817
H  0.762191 2.471214 -3.285983
H  -3.706561 1.297311 -2.055013
H  0.021803 4.523966 -2.111502
H  4.063574 -0.004357 -0.677964
H  3.211523 -3.522379 1.621799
H  -5.51648 1.779036 1.644223
elementType: Cl N C H
totalener: -1413.53957996 hartree
nucrepener: 2122.23260586 hartree
electener: -3535.77218582 hartree
oneelecener: -6144.35432608 hartree
twoeener: 2608.58214027 hartree
cpcmener: -0.03051298 hartree
kineticenergy: 1408.74087920 hartree
xcener: -115.431073595074 hartree
chargesum: 0.0000000
charge: -0.106151 0.136402 -0.367225 -0.395584 -0.053283 0.762795 -0.222116 -0.154069 -0.138490 -0.111142 -0.002158 -0.437521 -0.278055 -0.203882 -0.150728 -0.180368 -0.134629 -0.124478 0.053960 -0.169008 -0.166967 -0.161159 0.077777 0.120058 0.119879 0.105792 0.150217 0.146676 0.110470 0.109738 0.151203 0.132079 0.141080 0.135986 0.160663 0.159989 0.175658 0.161108 0.140843 0.141934 0.162708
qa: -0.1062 0.1364 -0.3672 -0.3956 -0.0533 0.7628 -0.2221 -0.1541 -0.1385 -0.1111 -0.0022 -0.4375 -0.2781 -0.2039 -0.1507 -0.1804 -0.1346 -0.1245 0.0540 -0.1690 -0.1670 -0.1612 0.0778 0.1201 0.1199 0.1058 0.1502 0.1467 0.1105 0.1097 0.1512 0.1321 0.1411 0.1360 0.1607 0.1600 0.1757 0.1611 0.1408 0.1419 0.1627
va: 1.1991 3.3187 2.8540 3.0283 3.1418 3.2716 3.8274 3.8819 3.5482 3.8706 3.5764 4.1556 3.9151 3.9121 3.9024 3.9651 3.9371 3.8897 4.0665 3.9291 4.0208 3.9993 4.0221 3.8054 1.0068 1.0351 0.9975 1.0064 1.0056 1.0072 1.0027 1.0233 0.9905 1.0048 0.9904 0.9908 0.9927 0.9885 1.0060 1.0042 0.9943
dispcorr: -0.025840180 hartree
energy: -1413.565420139599
dipole: -14.34742 13.54909 -0.79833 12.32466 -11.15532 1.16934 4.39913 -3.97879 0.42034
magnitude: 1.47695 au
magnitude: 3.75410 debye
