program: Orca
programVersion: 4.2.1
elementType: Cl N N N N C C C C C C C C C C C C C C C C C C C H H H H H H H H H H H H H H H H H
charge: 0
multiplicity: 1
keywords: wb97x-d3
keywords: def2-TZVPP
keywords: def2/J RIJCOSX GRIDX6 NOFINALGRIDX
keywords: grid4 nofinalgrid
keywords: scfconv7
keywords: smallprint printgap noloewdin
keywords: NOSOSCF
formula: C19H17ClN4
InChI: InChI=1S/C19H17ClN4/c20-18-8-6-16(7-9-18)10-11-19(12-21,13-24-15-22-14-23-24)17-4-2-1-3-5-17/h1-9,14-15H,10-11,13H2
41 atoms
Cl 5.052143 -0.048489 3.738925
N  -2.753822 0.804167 0.463228
N  -2.137351 1.496489 1.428871
N  -3.691145 0.140787 2.30808
N  -2.473671 -2.396659 -1.356022
C  -1.324521 -0.05105 -1.433098
C  -0.031789 -0.065766 -0.572049
C  -2.378926 0.963624 -0.91408
C  -1.008675 0.357615 -2.870236
C  -0.024822 -0.988322 0.65046
C  1.235665 -0.778783 1.442776
C  -1.94858 -1.374808 -1.406354
C  -1.443863 -0.371091 -3.970056
C  -0.278398 1.525033 -3.087807
C  2.319631 -1.638693 1.314997
C  1.357214 0.314937 2.29581
C  -1.150058 0.053802 -5.258866
C  0.012639 1.949191 -4.373201
C  -3.678427 -0.003025 1.008637
C  -0.422708 1.213297 -5.465832
C  3.496508 -1.422991 2.016198
C  2.524228 0.545539 3.004341
C  -2.731932 1.06578 2.515613
C  3.590754 -0.328346 2.858446
H  0.168257 0.958183 -0.249629
H  0.799162 -0.353098 -1.218845
H  -1.979586 1.970101 -1.022617
H  -3.272799 0.896082 -1.535346
H  -0.088794 -2.028939 0.32706
H  -0.889581 -0.812891 1.290333
H  -2.010208 -1.28341 -3.834907
H  0.079681 2.112361 -2.250983
H  2.247774 -2.498643 0.659795
H  0.523134 0.998642 2.404763
H  -1.49287 -0.530928 -6.102024
H  0.583574 2.85627 -4.520044
H  -4.302752 -0.665134 0.428273
H  -0.193567 1.542186 -6.470544
H  4.330989 -2.102203 1.909839
H  2.605044 1.395882 3.667317
H  -2.47021 1.438405 3.49349
totalener: -1413.51223139 hartree
nucrepener: 2028.42802419 hartree
electener: -3441.94025557 hartree
oneelecener: -5956.17620216 hartree
twoeener: 2514.23594658 hartree
kineticenergy: 1408.73197672 hartree
xcener: -115.420782636043 hartree
chargesum: -0.0000000
charge: -0.084920 0.107895 -0.334791 -0.319893 0.022946 0.717885 -0.270577 -0.179345 -0.092908 -0.094643 0.072952 -0.483800 -0.167517 -0.235638 -0.199207 -0.208758 -0.113190 -0.140738 0.059834 -0.121910 -0.113923 -0.136853 0.072279 0.083694 0.105646 0.120228 0.136032 0.141614 0.097513 0.124507 0.135025 0.129147 0.113926 0.132869 0.133380 0.132274 0.150597 0.133010 0.119966 0.119646 0.135745
qa: -0.0849 0.1079 -0.3348 -0.3199 0.0229 0.7179 -0.2706 -0.1793 -0.0929 -0.0946 0.0730 -0.4838 -0.1675 -0.2356 -0.1992 -0.2088 -0.1132 -0.1407 0.0598 -0.1219 -0.1139 -0.1369 0.0723 0.0837 0.1056 0.1202 0.1360 0.1416 0.0975 0.1245 0.1350 0.1291 0.1139 0.1329 0.1334 0.1323 0.1506 0.1330 0.1200 0.1196 0.1357
va: 1.2215 3.3113 2.7976 3.0658 3.1134 3.3600 3.8604 3.9209 3.6832 3.7625 3.6081 4.0552 3.9840 4.0450 4.0452 4.0057 3.9734 4.0188 4.0599 3.9657 3.9970 4.0498 4.0141 3.9171 1.0137 1.0110 1.0097 1.0030 1.0249 1.0101 1.0223 1.0093 1.0121 1.0147 1.0014 1.0013 1.0051 0.9986 1.0126 1.0143 1.0017
dispcorr: -0.022258980 hartree
energy: -1413.534490367360
dipole: -11.70778 11.76340 0.05562 3.09063 -2.02926 1.06137 -17.75147 15.99408 -1.75740
magnitude: 2.05379 au
magnitude: 5.22031 debye
