program: Orca
programVersion: 4.2.1
elementType: Cl N N N N C C C C C C C C C C C C C C C C C C C H H H H H H H H H H H H H H H H H
charge: 0
multiplicity: 1
keywords: wb97x-d3
keywords: def2-TZVPP
keywords: def2/J RIJCOSX GRIDX6 NOFINALGRIDX
keywords: grid4 nofinalgrid
keywords: scfconv7
keywords: smallprint printgap noloewdin
keywords: NOSOSCF
formula: C19H17ClN4
InChI: InChI=1S/C19H17ClN4/c20-18-8-6-16(7-9-18)10-11-19(12-21,13-24-15-22-14-23-24)17-4-2-1-3-5-17/h1-9,14-15H,10-11,13H2
41 atoms
Cl 5.06208 -1.066383 -0.882939
N  -3.803424 0.599802 0.140885
N  -4.27947 0.914629 1.352777
N  -5.680558 -0.483865 0.301469
N  -1.812691 -2.095009 -1.038128
C  -1.311032 0.248729 0.004171
C  -1.127816 0.081184 1.53295
C  -2.551045 1.127619 -0.325006
C  -0.102648 0.915234 -0.653228
C  -0.231325 -1.081671 1.969599
C  1.123922 -1.118585 1.319179
C  -1.566157 -1.066929 -0.585553
C  0.645269 0.299692 -1.648223
C  0.262879 2.195494 -0.24173
C  2.036303 -0.083951 1.507781
C  1.481604 -2.163316 0.476873
C  1.751308 0.933636 -2.194954
C  1.357751 2.835367 -0.79795
C  -4.655532 -0.239935 -0.470974
C  2.113085 2.201966 -1.773258
C  3.249224 -0.065146 0.844939
C  2.698094 -2.167206 -0.190259
C  -5.402414 0.242098 1.404132
C  3.567967 -1.107186 -0.012618
H  -2.104217 -0.053303 1.99902
H  -0.739947 1.02431 1.922117
H  -2.424806 2.109833 0.125673
H  -2.60665 1.264364 -1.405334
H  -0.749761 -2.024089 1.781023
H  -0.123762 -1.0148 3.055729
H  0.389656 -0.694033 -1.990519
H  -0.295378 2.706362 0.534159
H  1.789967 0.740142 2.166706
H  0.79039 -2.98104 0.314083
H  2.337036 0.42386 -2.94813
H  1.624628 3.828484 -0.461225
H  -4.485338 -0.639765 -1.458678
H  2.978529 2.692096 -2.198662
H  3.93724 0.757165 0.982484
H  2.957107 -2.982279 -0.851823
H  -6.048704 0.28081 2.266787
totalener: -1413.50980270 hartree
nucrepener: 2147.21422408 hartree
electener: -3560.72402678 hartree
oneelecener: -6194.04798920 hartree
twoeener: 2633.32396242 hartree
kineticenergy: 1408.76211254 hartree
xcener: -115.434433163275 hartree
chargesum: 0.0000000
charge: -0.088832 0.107664 -0.333940 -0.330476 0.021351 0.827953 -0.209579 -0.190137 -0.186503 -0.144846 0.097497 -0.523876 -0.112628 -0.261201 -0.169855 -0.191015 -0.131298 -0.145310 0.058293 -0.116320 -0.140617 -0.115905 0.079744 0.092790 0.119570 0.101056 0.134747 0.149483 0.105308 0.106657 0.130768 0.114697 0.107555 0.120290 0.130314 0.128977 0.152863 0.131263 0.115752 0.122507 0.135240
qa: -0.0888 0.1077 -0.3339 -0.3305 0.0214 0.8280 -0.2096 -0.1901 -0.1865 -0.1448 0.0975 -0.5239 -0.1126 -0.2612 -0.1699 -0.1910 -0.1313 -0.1453 0.0583 -0.1163 -0.1406 -0.1159 0.0797 0.0928 0.1196 0.1011 0.1347 0.1495 0.1053 0.1067 0.1308 0.1147 0.1076 0.1203 0.1303 0.1290 0.1529 0.1313 0.1158 0.1225 0.1352
va: 1.2181 3.3055 2.8413 3.0679 3.1041 3.1570 3.8291 3.8900 3.6701 3.8262 3.5438 4.0830 3.8672 4.0548 3.9845 3.9627 3.9360 3.9969 4.0698 3.9405 3.9497 3.9996 4.0267 3.8672 1.0453 1.0027 1.0106 0.9968 1.0096 1.0029 1.0188 1.0168 1.0103 1.0161 1.0052 1.0008 1.0011 0.9991 1.0155 1.0122 0.9993
dispcorr: -0.027094963 hartree
energy: -1413.536897663040
dipole: -9.42204 10.20074 0.77869 7.54224 -6.12253 1.41971 5.43033 -5.21691 0.21342
magnitude: 1.63325 au
magnitude: 4.15138 debye
