program: Orca
programVersion: 4.2.1
elementType: Cl N N N N C C C C C C C C C C C C C C C C C C C H H H H H H H H H H H H H H H H H
charge: 0
multiplicity: 1
keywords: wb97x-d3
keywords: def2-TZVPP
keywords: def2/J RIJCOSX GRIDX6 NOFINALGRIDX
keywords: grid4 nofinalgrid
keywords: scfconv7
keywords: smallprint printgap noloewdin
keywords: NOSOSCF
formula: C19H17ClN4
InChI: InChI=1S/C19H17ClN4/c20-18-8-6-16(7-9-18)10-11-19(12-21,13-24-15-22-14-23-24)17-4-2-1-3-5-17/h1-9,14-15H,10-11,13H2
41 atoms
Cl 5.018545 -0.078159 3.860948
N  -3.236986 0.884296 0.375212
N  -2.758375 1.555218 1.430342
N  -4.543281 0.334893 2.022421
N  -2.584519 -2.40381 -0.924832
C  -1.479295 -0.046139 -1.161821
C  -0.35828 0.063473 -0.105808
C  -2.610399 0.987353 -0.912217
C  -0.946686 0.18724 -2.571553
C  0.792974 -0.9133 -0.339419
C  1.865821 -0.732611 0.696717
C  -2.083321 -1.375959 -1.046065
C  -0.291682 1.385464 -2.851853
C  -1.098698 -0.741973 -3.593066
C  2.94882 0.107563 0.4630
C  1.779985 -1.365735 1.932432
C  0.197318 1.64665 -4.120671
C  -0.606356 -0.481142 -4.86479
C  -4.303971 0.158581 0.750435
C  0.041927 0.712014 -5.13411
C  3.921642 0.315145 1.427897
C  2.742283 -1.170706 2.909599
C  -3.571276 1.195156 2.392343
C  3.810487 -0.327149 2.650025
H  -0.779406 -0.096437 0.887763
H  0.018132 1.08874 -0.104475
H  -2.200853 1.992138 -0.99742
H  -3.371433 0.873457 -1.684911
H  1.212798 -0.764983 -1.336713
H  0.418077 -1.939982 -0.309823
H  -0.14904 2.128586 -2.076723
H  -1.598384 -1.68366 -3.406763
H  3.041458 0.607326 -0.49412
H  0.948475 -2.029458 2.138334
H  0.702671 2.582955 -4.316485
H  -0.731882 -1.219992 -5.644893
H  -4.858108 -0.472453 0.072874
H  0.425199 0.913911 -6.125199
H  4.760826 0.967547 1.230194
H  2.664358 -1.672717 3.863929
H  -3.463224 1.570287 3.397521
totalener: -1413.51485535 hartree
nucrepener: 2011.37933965 hartree
electener: -3424.89419500 hartree
oneelecener: -5922.07925277 hartree
twoeener: 2497.18505777 hartree
kineticenergy: 1408.74364485 hartree
xcener: -115.422215973200 hartree
chargesum: 0.0000000
charge: -0.082529 0.102793 -0.329216 -0.330107 0.027096 0.730343 -0.248767 -0.172787 -0.235334 -0.071636 0.068625 -0.465814 -0.226038 -0.107620 -0.191278 -0.196426 -0.143115 -0.120272 0.059162 -0.111014 -0.126366 -0.124216 0.075328 0.080013 0.125129 0.111582 0.133476 0.143598 0.096444 0.110189 0.120724 0.133272 0.112673 0.122487 0.132707 0.132859 0.151581 0.133515 0.120166 0.122504 0.136271
qa: -0.0825 0.1028 -0.3292 -0.3301 0.0271 0.7303 -0.2488 -0.1728 -0.2353 -0.0716 0.0686 -0.4658 -0.2260 -0.1076 -0.1913 -0.1964 -0.1431 -0.1203 0.0592 -0.1110 -0.1264 -0.1242 0.0753 0.0800 0.1251 0.1116 0.1335 0.1436 0.0964 0.1102 0.1207 0.1333 0.1127 0.1225 0.1327 0.1329 0.1516 0.1335 0.1202 0.1225 0.1363
va: 1.2238 3.3087 2.8396 3.0675 3.1145 3.3723 3.8478 3.9017 3.6908 3.7275 3.6123 4.0843 4.0395 3.9255 4.0209 4.0259 4.0179 3.9827 4.0698 3.9507 4.0153 4.0112 4.0308 3.9305 1.0274 1.0177 1.0123 1.0009 1.0153 1.0152 1.0181 1.0224 1.0115 1.0094 1.0010 1.0021 1.0010 0.9986 1.0124 1.0117 0.9995
dispcorr: -0.021321072 hartree
energy: -1413.536176419480
dipole: -9.59186 10.03827 0.44641 2.75326 -1.77587 0.97738 -19.17866 17.24555 -1.93311
magnitude: 2.21167 au
magnitude: 5.62161 debye
