program: Orca
programVersion: 4.2.1
elementType: Cl Cl O O N N N C C C C C C C C C C C C C C H H H H H H H H H H H H H H H
charge: 0
multiplicity: 1
keywords: wb97x-d3
keywords: def2-TZVPP
keywords: def2/J RIJCOSX GRIDX6 NOFINALGRIDX
keywords: grid4 nofinalgrid
keywords: scfconv7
keywords: smallprint printgap noloewdin
keywords: NOSOSCF
formula: C14H15Cl2N3O2
InChI: InChI=1S/C14H15Cl2N3O2/c1-2-11-6-20-14(21-11,7-19-9-17-8-18-19)12-4-3-10(15)5-13(12)16/h3-5,8-9,11H,2,6-7H2,1H3
36 atoms
Cl 1.437876 -0.730116 2.375299
Cl 4.17544 -3.407708 -1.327336
O  -1.200021 0.514791 -1.076178
O  -1.134253 -0.112954 1.083571
N  -0.770443 2.716384 0.603412
N  -1.280477 2.882498 1.827348
N  -2.400733 4.128099 0.332328
C  -0.351103 0.363833 0.022062
C  -2.417015 -0.18677 -0.829775
C  -2.494111 -0.136268 0.684947
C  0.251741 1.744149 0.325345
C  0.77699 -0.618207 -0.277729
C  -3.561869 0.492749 -1.547474
C  -4.88984 -0.194452 -1.263387
C  1.620544 -1.138225 0.702804
C  1.030459 -0.986642 -1.595186
C  2.662014 -1.999167 0.39041
C  2.06348 -1.843137 -1.936136
C  -1.458165 3.449243 -0.274215
C  2.872587 -2.344441 -0.932631
C  -2.247986 3.734385 1.611677
H  -2.320972 -1.22511 -1.173531
H  -3.022283 0.759753 1.034858
H  -2.974425 -1.01256 1.119766
H  0.828531 2.081986 -0.536336
H  0.927163 1.70023 1.176483
H  -3.369004 0.487406 -2.622587
H  -3.61052 1.539976 -1.235687
H  -4.87263 -1.242235 -1.566704
H  -5.149461 -0.159159 -0.203944
H  -5.697244 0.2925 -1.80888
H  0.408248 -0.595425 -2.386876
H  3.299062 -2.389185 1.171569
H  2.230137 -2.107311 -2.970608
H  -1.224291 3.478558 -1.326172
H  -2.866887 4.099253 2.416269
elementType: Cl O N C H
totalener: -1777.71959086 hartree
nucrepener: 2017.60652643 hartree
electener: -3795.32611729 hartree
oneelecener: -6448.85566551 hartree
twoeener: 2653.52954822 hartree
cpcmener: -0.02772208 hartree
kineticenergy: 1772.81608295 hartree
xcener: -124.640937934166 hartree
chargesum: -0.0000000
charge: -0.074349 -0.083979 -0.414606 -0.375813 0.132232 -0.358376 -0.413502 0.584267 0.173185 -0.022375 -0.110712 -0.061957 -0.137495 -0.273488 -0.061624 -0.136608 -0.137883 -0.180749 0.038363 0.108709 0.059690 0.094174 0.083098 0.116690 0.139091 0.136519 0.078665 0.067468 0.089556 0.083763 0.096984 0.151927 0.123148 0.147897 0.176421 0.161668
qa: -0.0743 -0.0840 -0.4146 -0.3758 0.1322 -0.3584 -0.4135 0.5843 0.1732 -0.0224 -0.1107 -0.0620 -0.1375 -0.2735 -0.0616 -0.1366 -0.1379 -0.1807 0.0384 0.1087 0.0597 0.0942 0.0831 0.1167 0.1391 0.1365 0.0787 0.0675 0.0896 0.0838 0.0970 0.1519 0.1231 0.1479 0.1764 0.1617
va: 1.2452 1.2201 1.9819 1.9939 3.3627 2.8766 2.9960 3.8401 3.8057 3.9866 3.8109 3.6178 3.9575 3.9498 4.0505 3.9257 4.0713 4.0455 4.0607 3.8629 4.0426 1.0030 0.9886 0.9940 1.0063 1.0285 1.0085 1.0125 1.0011 1.0008 1.0032 1.0230 1.0244 1.0061 0.9986 0.9966
dispcorr: -0.020403068 hartree
energy: -1777.739993929157
dipole: -33.23981 33.02551 -0.21430 10.76773 -11.59680 -0.82907 -10.02805 8.34113 -1.68693
magnitude: 1.89183 au
magnitude: 4.80864 debye
