program: Orca
programVersion: 4.2.1
elementType: Cl Cl O O N N N C C C C C C C C C C C C C C H H H H H H H H H H H H H H H
charge: 0
multiplicity: 1
keywords: wb97x-d3
keywords: def2-TZVPP
keywords: def2/J RIJCOSX GRIDX6 NOFINALGRIDX
keywords: grid4 nofinalgrid
keywords: scfconv7
keywords: smallprint printgap noloewdin
keywords: NOSOSCF
formula: C14H15Cl2N3O2
InChI: InChI=1S/C14H15Cl2N3O2/c1-2-11-6-20-14(21-11,7-19-9-17-8-18-19)12-4-3-10(15)5-13(12)16/h3-5,8-9,11H,2,6-7H2,1H3
36 atoms
Cl 0.242187 -0.467116 -2.664839
Cl 4.494393 -1.791293 0.256785
O  -2.060464 -0.57831 -0.808559
O  -1.758178 0.067802 1.330647
N  -0.283489 2.412177 0.29278
N  0.937142 2.642863 -0.199304
N  0.801389 3.351278 1.925446
C  -1.221059 0.15617 0.037151
C  -3.018087 -1.28389 -0.020142
C  -3.086269 -0.418398 1.222144
C  -1.247103 1.622669 -0.431202
C  0.201784 -0.384738 0.068822
C  -4.317763 -1.422074 -0.780973
C  -5.371153 -2.154658 0.037559
C  0.926064 -0.668029 -1.086628
C  0.860404 -0.540484 1.284985
C  2.239814 -1.108144 -1.039539
C  2.17491 -0.968157 1.36216
C  -0.342029 2.825489 1.559447
C  2.853552 -1.252603 0.191561
C  1.542078 3.207649 0.810963
H  -2.627171 -2.277807 0.233855
H  -3.802478 0.404341 1.104292
H  -3.329956 -0.966753 2.130551
H  -2.244449 2.035972 -0.274946
H  -1.017202 1.705077 -1.490326
H  -4.133214 -1.967014 -1.709141
H  -4.681864 -0.429393 -1.058685
H  -5.026325 -3.144744 0.339352
H  -5.63983 -1.606804 0.942338
H  -6.284155 -2.287807 -0.541946
H  0.345628 -0.322809 2.209009
H  2.774504 -1.327702 -1.952791
H  2.653626 -1.075583 2.325077
H  -1.230258 2.746211 2.164653
H  2.566024 3.538887 0.739136
elementType: Cl O N C H
totalener: -1777.71760642 hartree
nucrepener: 2045.18850462 hartree
electener: -3822.90611104 hartree
oneelecener: -6504.48207119 hartree
twoeener: 2681.57596015 hartree
cpcmener: -0.02772029 hartree
kineticenergy: 1772.83110119 hartree
xcener: -124.642557925684 hartree
chargesum: 0.0000000
charge: -0.074908 -0.085754 -0.374124 -0.395202 0.116762 -0.336011 -0.409161 0.535013 0.140477 0.010964 -0.131007 -0.040254 -0.112558 -0.279445 -0.012637 -0.159073 -0.141234 -0.180228 0.058161 0.113812 0.057870 0.080936 0.083985 0.115819 0.129932 0.131666 0.072867 0.062205 0.087556 0.084706 0.097298 0.151180 0.121585 0.148064 0.170068 0.160670
qa: -0.0749 -0.0858 -0.3741 -0.3952 0.1168 -0.3360 -0.4092 0.5350 0.1405 0.0110 -0.1310 -0.0403 -0.1126 -0.2794 -0.0126 -0.1591 -0.1412 -0.1802 0.0582 0.1138 0.0579 0.0809 0.0840 0.1158 0.1299 0.1317 0.0729 0.0622 0.0876 0.0847 0.0973 0.1512 0.1216 0.1481 0.1701 0.1607
va: 1.2446 1.2182 2.0216 1.9621 3.3510 2.8869 3.0312 3.8934 3.9212 3.9231 3.9098 3.5771 3.9296 3.9480 3.9856 3.9095 4.0867 4.0575 4.0754 3.8529 4.0456 1.0039 0.9999 0.9915 1.0074 1.0267 1.0105 1.0138 1.0008 1.0006 1.0033 1.0229 1.0246 1.0046 1.0060 0.9969
dispcorr: -0.020683085 hartree
energy: -1777.738289508009
dipole: -36.17823 33.43365 -2.74458 -1.45198 0.51969 -0.93229 8.26333 -7.75315 0.51019
magnitude: 2.94316 au
magnitude: 7.48092 debye
