program: Orca
programVersion: 4.2.1
elementType: Cl Cl O O N N N C C C C C C C C C C C C C C H H H H H H H H H H H H H H H
charge: 0
multiplicity: 1
keywords: wb97x-d3
keywords: def2-TZVPP
keywords: def2/J RIJCOSX GRIDX6 NOFINALGRIDX
keywords: grid4 nofinalgrid
keywords: scfconv7
keywords: smallprint printgap noloewdin
keywords: NOSOSCF
formula: C14H15Cl2N3O2
InChI: InChI=1S/C14H15Cl2N3O2/c1-2-11-6-20-14(21-11,7-19-9-17-8-18-19)12-4-3-10(15)5-13(12)16/h3-5,8-9,11H,2,6-7H2,1H3
36 atoms
Cl 1.514898 -0.658304 2.373054
Cl 4.112696 -3.426437 -1.364579
O  -1.303394 0.40932 -0.99131
O  -1.132178 -0.14769 1.175231
N  -0.90154 2.689177 0.583257
N  -1.470205 2.828184 1.783733
N  -2.465228 4.168071 0.281431
C  -0.407674 0.329021 0.071167
C  -2.319474 -0.564888 -0.763159
C  -2.432506 -0.525598 0.751159
C  0.143555 1.73431 0.330824
C  0.746826 -0.619994 -0.253321
C  -3.572663 -0.233748 -1.54666
C  -4.131095 1.165506 -1.336171
C  1.632112 -1.109735 0.705214
C  0.960752 -1.00928 -1.572234
C  2.668167 -1.970387 0.373637
C  1.984688 -1.868584 -1.93244
C  -1.51232 3.481094 -0.298488
C  2.829779 -2.347252 -0.94768
C  -2.396701 3.720041 1.54927
H  -1.957415 -1.552487 -1.077547
H  -3.166807 0.207085 1.100075
H  -2.688886 -1.499528 1.169464
H  0.706946 2.068052 -0.540399
H  0.826341 1.731896 1.177377
H  -4.320837 -0.982985 -1.273484
H  -3.36973 -0.391528 -2.608791
H  -4.366117 1.369704 -0.289539
H  -3.437022 1.934153 -1.676066
H  -5.053977 1.286515 -1.904851
H  0.308512 -0.637994 -2.349789
H  3.336574 -2.338541 1.139155
H  2.114267 -2.154797 -2.966514
H  -1.214982 3.544221 -1.332972
H  -3.048263 4.073133 2.333391
elementType: Cl O N C H
totalener: -1777.71769352 hartree
nucrepener: 2028.53443300 hartree
electener: -3806.25212652 hartree
oneelecener: -6470.78012355 hartree
twoeener: 2664.52799703 hartree
cpcmener: -0.02911586 hartree
kineticenergy: 1772.81792489 hartree
xcener: -124.642696464729 hartree
chargesum: 0.0000000
charge: -0.075226 -0.084368 -0.405330 -0.370803 0.144795 -0.357403 -0.413908 0.589855 0.111516 0.016146 -0.110526 -0.067461 -0.112694 -0.276041 -0.060346 -0.153060 -0.141038 -0.180342 0.032367 0.110034 0.059309 0.102001 0.083033 0.104221 0.136740 0.137321 0.073319 0.076837 0.074094 0.085102 0.106362 0.153694 0.122350 0.148269 0.179435 0.161744
qa: -0.0752 -0.0844 -0.4053 -0.3708 0.1448 -0.3574 -0.4139 0.5899 0.1115 0.0161 -0.1105 -0.0675 -0.1127 -0.2760 -0.0603 -0.1531 -0.1410 -0.1803 0.0324 0.1100 0.0593 0.1020 0.0830 0.1042 0.1367 0.1373 0.0733 0.0768 0.0741 0.0851 0.1064 0.1537 0.1224 0.1483 0.1794 0.1617
va: 1.2444 1.2198 1.9895 1.9943 3.3724 2.8913 3.0001 3.8461 3.8987 3.9724 3.8171 3.5794 3.9387 3.9379 4.0543 3.9320 4.0762 4.0443 4.0668 3.8619 4.0419 0.9940 0.9976 0.9989 1.0065 1.0270 1.0098 1.0060 1.0079 1.0049 1.0028 1.0216 1.0253 1.0059 0.9925 0.9958
dispcorr: -0.021010260 hartree
energy: -1777.738703777996
dipole: -31.29498 31.20252 -0.09246 11.64884 -12.78610 -1.13726 -10.15770 8.44172 -1.71598
magnitude: 2.06070 au
magnitude: 5.23789 debye
