program: Orca
programVersion: 4.2.1
elementType: Cl Cl O O N N N C C C C C C C C C C C C C C H H H H H H H H H H H H H H H
charge: 0
multiplicity: 1
keywords: wb97x-d3
keywords: def2-TZVPP
keywords: def2/J RIJCOSX GRIDX6 NOFINALGRIDX
keywords: grid4 nofinalgrid
keywords: scfconv7
keywords: smallprint printgap noloewdin
keywords: NOSOSCF
formula: C14H15Cl2N3O2
InChI: InChI=1S/C14H15Cl2N3O2/c1-2-11-6-20-14(21-11,7-19-9-17-8-18-19)12-4-3-10(15)5-13(12)16/h3-5,8-9,11H,2,6-7H2,1H3
36 atoms
Cl 1.401956 -0.634658 2.316602
Cl 4.044406 -3.548195 -1.275409
O  -1.210622 0.523526 -1.173447
O  -1.154418 0.049401 0.994974
N  -0.750005 2.785617 0.50968
N  -1.079353 3.042011 1.777077
N  -2.364987 4.226391 0.377908
C  -0.353806 0.430179 -0.073181
C  -2.355741 -0.302638 -0.952219
C  -2.113006 -0.844116 0.461301
C  0.2536 1.811739 0.177772
C  0.760057 -0.583566 -0.3442
C  -3.621058 0.522594 -1.103922
C  -4.872126 -0.34244 -1.102266
C  1.576698 -1.104206 0.659165
C  1.011386 -1.000898 -1.647765
C  2.584628 -2.015836 0.382449
C  2.012271 -1.907593 -1.95344
C  -1.528436 3.491976 -0.314179
C  2.790275 -2.412208 -0.927134
C  -2.046734 3.911902 1.649932
H  -2.357122 -1.116406 -1.685279
H  -2.997838 -0.819219 1.097746
H  -1.733421 -1.871313 0.444268
H  0.780946 2.13233 -0.720494
H  0.976553 1.783413 0.989712
H  -3.567763 1.078579 -2.043546
H  -3.674702 1.264143 -0.301218
H  -4.858843 -1.065169 -1.920325
H  -4.987212 -0.90134 -0.171509
H  -5.76567 0.270445 -1.221399
H  0.410295 -0.609137 -2.456192
H  3.198515 -2.407845 1.181378
H  2.176045 -2.211034 -2.978029
H  -1.442365 3.448341 -1.388098
H  -2.540639 4.342647 2.507251
elementType: Cl O N C H
totalener: -1777.72748991 hartree
nucrepener: 2019.03579941 hartree
electener: -3796.76328932 hartree
oneelecener: -6451.63825829 hartree
twoeener: 2654.87496897 hartree
cpcmener: -0.02542438 hartree
kineticenergy: 1772.80687999 hartree
xcener: -124.637794627781 hartree
chargesum: 0.0000000
charge: -0.070587 -0.081583 -0.400693 -0.349061 0.136065 -0.343864 -0.412484 0.572302 0.141367 0.021162 -0.099133 -0.146769 -0.130053 -0.267936 -0.019897 -0.126343 -0.153539 -0.195293 0.044604 0.120047 0.057106 0.087135 0.107998 0.092305 0.141748 0.135516 0.071593 0.063825 0.084608 0.076792 0.095716 0.152296 0.121787 0.146032 0.167489 0.159741
qa: -0.0706 -0.0816 -0.4007 -0.3491 0.1361 -0.3439 -0.4125 0.5723 0.1414 0.0212 -0.0991 -0.1468 -0.1301 -0.2679 -0.0199 -0.1263 -0.1535 -0.1953 0.0446 0.1200 0.0571 0.0871 0.1080 0.0923 0.1417 0.1355 0.0716 0.0638 0.0846 0.0768 0.0957 0.1523 0.1218 0.1460 0.1675 0.1597
va: 1.2498 1.2225 1.9902 2.0106 3.3637 2.8858 3.0115 3.9120 3.8664 3.9138 3.7718 3.5547 3.9346 3.9513 4.0111 3.9463 4.0837 4.0595 4.0715 3.8584 4.0493 0.9996 0.9975 1.0028 1.0062 1.0313 1.0129 1.0086 1.0020 1.0054 1.0028 1.0217 1.0263 1.0071 1.0029 0.9955
dispcorr: -0.020318319 hartree
energy: -1777.747808225411
dipole: -32.08613 32.03869 -0.04745 8.76008 -10.09208 -1.33200 -9.56906 7.91065 -1.65841
magnitude: 2.12763 au
magnitude: 5.40800 debye
