program: Orca
programVersion: 4.2.1
elementType: Cl Cl O O N N N C C C C C C C C C C C C C C H H H H H H H H H H H H H H H
charge: 0
multiplicity: 1
keywords: wb97x-d3
keywords: def2-TZVPP
keywords: def2/J RIJCOSX GRIDX6 NOFINALGRIDX
keywords: grid4 nofinalgrid
keywords: scfconv7
keywords: smallprint printgap noloewdin
keywords: NOSOSCF
formula: C14H15Cl2N3O2
InChI: InChI=1S/C14H15Cl2N3O2/c1-2-11-6-20-14(21-11,7-19-9-17-8-18-19)12-4-3-10(15)5-13(12)16/h3-5,8-9,11H,2,6-7H2,1H3
36 atoms
Cl 0.198429 0.953347 -1.802311
Cl 4.229568 -2.345213 -0.760302
O  -1.996333 0.248151 -0.06407
O  -1.776442 -1.054533 1.713007
N  -0.255164 2.22681 1.229315
N  1.075061 2.333439 1.218163
N  0.144888 4.026744 0.089054
C  -1.115585 -0.080638 0.953712
C  -2.634116 -0.95831 -0.463014
C  -2.583075 -1.809165 0.819286
C  -0.920628 1.1276 1.873368
C  0.217769 -0.633132 0.440798
C  -4.028581 -0.658161 -0.971096
C  -4.723566 -1.910223 -1.484784
C  0.857094 -0.233466 -0.731082
C  0.876776 -1.572676 1.231598
C  2.086214 -0.760389 -1.105934
C  2.103839 -2.107596 0.885931
C  -0.795799 3.240583 0.54832
C  2.698972 -1.693316 -0.292307
C  1.269277 3.423637 0.523252
H  -2.051654 -1.438355 -1.260212
H  -3.566158 -1.940769 1.276797
H  -2.152384 -2.796769 0.638197
H  -0.336295 0.838531 2.745709
H  -1.897944 1.466707 2.217336
H  -3.963339 0.077651 -1.776358
H  -4.615404 -0.204193 -0.167413
H  -4.846631 -2.663276 -0.703893
H  -5.718556 -1.672269 -1.860586
H  -4.166098 -2.370365 -2.302438
H  0.416543 -1.903297 2.152496
H  2.556951 -0.437547 -2.023785
H  2.582916 -2.833806 1.526972
H  -1.859527 3.365915 0.425568
H  2.258577 3.805563 0.32763
elementType: Cl O N C H
totalener: -1777.72480435 hartree
nucrepener: 2067.40119766 hartree
electener: -3845.12600201 hartree
oneelecener: -6548.93284383 hartree
twoeener: 2703.80684182 hartree
cpcmener: -0.02452521 hartree
kineticenergy: 1772.81957161 hartree
xcener: -124.641501371316 hartree
chargesum: 0.0000000
charge: -0.073117 -0.083857 -0.365558 -0.388635 0.096884 -0.345262 -0.398531 0.590941 0.118027 0.007371 -0.059440 -0.051480 -0.111999 -0.272822 -0.071800 -0.202863 -0.106882 -0.167813 0.062823 0.094038 0.058685 0.083892 0.096974 0.100011 0.129228 0.123800 0.070951 0.064491 0.079609 0.095975 0.086695 0.145269 0.119548 0.145879 0.168674 0.160293
qa: -0.0731 -0.0839 -0.3656 -0.3886 0.0969 -0.3453 -0.3985 0.5909 0.1180 0.0074 -0.0594 -0.0515 -0.1120 -0.2728 -0.0718 -0.2029 -0.1069 -0.1678 0.0628 0.0940 0.0587 0.0839 0.0970 0.1000 0.1292 0.1238 0.0710 0.0645 0.0796 0.0960 0.0867 0.1453 0.1195 0.1459 0.1687 0.1603
va: 1.2415 1.2207 2.0163 1.9782 3.3656 2.8670 3.0282 3.8333 3.8547 3.9135 3.8381 3.5201 3.9397 3.9444 3.9853 4.0216 4.0306 4.0182 4.0752 3.8806 4.0521 1.0034 0.9973 0.9940 1.0123 1.0199 1.0119 1.0133 1.0035 1.0030 1.0012 1.0244 1.0257 1.0058 0.9994 0.9962
dispcorr: -0.021021418 hartree
energy: -1777.745825769265
dipole: -31.73766 29.81717 -1.92049 -6.04504 4.26201 -1.78303 4.65202 -4.01825 0.63377
magnitude: 2.69613 au
magnitude: 6.85302 debye
