program: Orca
programVersion: 4.2.1
elementType: Cl Cl O O N N N C C C C C C C C C C C C C C H H H H H H H H H H H H H H H
charge: 0
multiplicity: 1
keywords: wb97x-d3
keywords: def2-TZVPP
keywords: def2/J RIJCOSX GRIDX6 NOFINALGRIDX
keywords: grid4 nofinalgrid
keywords: scfconv7
keywords: smallprint printgap noloewdin
keywords: NOSOSCF
formula: C14H15Cl2N3O2
InChI: InChI=1S/C14H15Cl2N3O2/c1-2-11-6-20-14(21-11,7-19-9-17-8-18-19)12-4-3-10(15)5-13(12)16/h3-5,8-9,11H,2,6-7H2,1H3
36 atoms
Cl 0.787541 -1.449657 2.493974
Cl 4.503808 -1.520974 -1.321148
O  -1.907361 0.056708 -0.792891
O  -1.791518 -1.211469 1.055098
N  -0.575575 2.199242 0.600597
N  -1.279088 2.981588 -0.220906
N  0.856678 3.650259 -0.141324
C  -1.153627 -0.18637 0.357694
C  -2.99612 -0.863014 -0.862049
C  -2.54825 -1.945421 0.107112
C  -1.165847 1.062171 1.255917
C  0.271453 -0.564156 -0.046697
C  -4.308587 -0.195946 -0.483085
C  -4.599219 1.059999 -1.289454
C  1.193366 -1.115127 0.842603
C  0.714617 -0.30905 -1.341432
C  2.49268 -1.414722 0.460066
C  2.006075 -0.594849 -1.749861
C  0.696911 2.606513 0.633635
C  2.886554 -1.150714 -0.839558
C  -0.38209 3.835669 -0.639964
H  -3.051507 -1.237204 -1.887942
H  -3.369556 -2.440112 0.625297
H  -1.936308 -2.708781 -0.386108
H  -0.622593 0.87706 2.181148
H  -2.193685 1.309988 1.518151
H  -4.314179 0.037701 0.586331
H  -5.104529 -0.929607 -0.639607
H  -3.852427 1.833689 -1.108808
H  -4.615486 0.853314 -2.361772
H  -5.572883 1.47277 -1.023029
H  0.035359 0.12738 -2.059365
H  3.183767 -1.847307 1.170184
H  2.313765 -0.382525 -2.764228
H  1.453632 2.127487 1.235864
H  -0.631809 4.631528 -1.32456
elementType: Cl O N C H
totalener: -1777.72459224 hartree
nucrepener: 2053.06769855 hartree
electener: -3830.79229079 hartree
oneelecener: -6519.87987421 hartree
twoeener: 2689.08758342 hartree
cpcmener: -0.02244465 hartree
kineticenergy: 1772.80754005 hartree
xcener: -124.638455169545 hartree
chargesum: 0.0000000
charge: -0.071912 -0.081499 -0.387155 -0.360469 0.147607 -0.353770 -0.403167 0.560685 0.159495 0.011794 -0.147320 -0.153645 -0.158729 -0.266878 -0.004963 -0.117647 -0.133259 -0.175588 0.043362 0.114382 0.075749 0.096958 0.104752 0.090512 0.149152 0.121809 0.069587 0.077363 0.077290 0.081216 0.092141 0.147500 0.120796 0.145833 0.169289 0.158731
qa: -0.0719 -0.0815 -0.3872 -0.3605 0.1476 -0.3538 -0.4032 0.5607 0.1595 0.0118 -0.1473 -0.1536 -0.1587 -0.2669 -0.0050 -0.1176 -0.1333 -0.1756 0.0434 0.1144 0.0757 0.0970 0.1048 0.0905 0.1492 0.1218 0.0696 0.0774 0.0773 0.0812 0.0921 0.1475 0.1208 0.1458 0.1693 0.1587
va: 1.2487 1.2222 1.9795 2.0046 3.2978 2.8674 3.0335 3.9140 3.8842 3.9897 3.8667 3.5824 3.9133 3.9266 3.9694 3.8733 4.0803 4.0591 4.0750 3.8635 4.0154 0.9946 0.9924 1.0022 1.0129 1.0209 1.0097 1.0119 1.0235 1.0012 1.0055 1.0287 1.0255 1.0056 0.9939 0.9946
dispcorr: -0.021329553 hartree
energy: -1777.745921790327
dipole: -33.80225 32.52565 -1.27661 7.29218 -8.79635 -1.50417 -7.40939 7.43962 0.03024
magnitude: 1.97311 au
magnitude: 5.01526 debye
