program: Orca
programVersion: 4.2.1
elementType: Cl Cl O O N N N C C C C C C C C C C C C C C H H H H H H H H H H H H H H H
charge: 0
multiplicity: 1
keywords: wb97x-d3
keywords: def2-TZVPP
keywords: def2/J RIJCOSX GRIDX6 NOFINALGRIDX
keywords: grid4 nofinalgrid
keywords: scfconv7
keywords: smallprint printgap noloewdin
keywords: NOSOSCF
formula: C14H15Cl2N3O2
InChI: InChI=1S/C14H15Cl2N3O2/c1-2-11-6-20-14(21-11,7-19-9-17-8-18-19)12-4-3-10(15)5-13(12)16/h3-5,8-9,11H,2,6-7H2,1H3
36 atoms
Cl 0.768897 -1.432097 2.510594
Cl 4.484037 -1.505208 -1.308546
O  -1.917208 0.182422 -0.7447
O  -1.783788 -1.195329 1.032231
N  -0.468794 2.220459 0.666064
N  0.823372 2.468388 0.895844
N  0.013608 3.888661 -0.633856
C  -1.150441 -0.130459 0.383716
C  -2.990016 -0.748425 -0.87275
C  -3.11049 -1.282477 0.543826
C  -1.137308 1.111335 1.295811
C  0.261038 -0.530212 -0.022431
C  -4.226527 -0.052558 -1.399227
C  -5.394618 -1.017389 -1.543916
C  1.179355 -1.091676 0.862435
C  0.699855 -0.275109 -1.317182
C  2.474634 -1.399307 0.475916
C  1.98905 -0.567784 -1.729475
C  -0.937186 3.069966 -0.25335
C  2.868018 -1.130713 -0.823108
C  1.068147 3.475633 0.098064
H  -2.695282 -1.553053 -1.558927
H  -3.798751 -0.677624 1.148455
H  -3.430649 -2.32263 0.593216
H  -0.626849 0.904428 2.233123
H  -2.163452 1.398376 1.530481
H  -4.001442 0.397249 -2.368773
H  -4.496189 0.764606 -0.724272
H  -6.257979 -0.516477 -1.981661
H  -5.142218 -1.858924 -2.191542
H  -5.711672 -1.424024 -0.581544
H  0.022016 0.167732 -2.032405
H  3.164654 -1.838208 1.183077
H  2.295575 -0.354735 -2.744012
H  -1.958339 3.060623 -0.600006
H  2.04292 3.936053 0.046524
elementType: Cl O N C H
totalener: -1777.72626990 hartree
nucrepener: 2035.44274666 hartree
electener: -3813.16901656 hartree
oneelecener: -6484.86060431 hartree
twoeener: 2671.69158775 hartree
cpcmener: -0.02432866 hartree
kineticenergy: 1772.79520526 hartree
xcener: -124.635981517748 hartree
chargesum: 0.0000000
charge: -0.074785 -0.084417 -0.401500 -0.368479 0.117490 -0.340377 -0.407619 0.610380 0.134300 0.008143 -0.146603 -0.088944 -0.113977 -0.274466 -0.045546 -0.112995 -0.136203 -0.192598 0.065564 0.118844 0.060843 0.077160 0.080957 0.112080 0.129413 0.131466 0.076109 0.057121 0.096950 0.086634 0.083919 0.148540 0.120694 0.144316 0.166643 0.160941
qa: -0.0748 -0.0844 -0.4015 -0.3685 0.1175 -0.3404 -0.4076 0.6104 0.1343 0.0081 -0.1466 -0.0889 -0.1140 -0.2745 -0.0455 -0.1130 -0.1362 -0.1926 0.0656 0.1188 0.0608 0.0772 0.0810 0.1121 0.1294 0.1315 0.0761 0.0571 0.0970 0.0866 0.0839 0.1485 0.1207 0.1443 0.1666 0.1609
va: 1.2467 1.2192 1.9844 2.0102 3.3524 2.8770 3.0386 3.7773 3.9134 3.9607 3.9390 3.6291 3.9340 3.9481 4.0246 3.8448 4.0809 4.0779 4.0762 3.8576 4.0409 1.0028 0.9944 0.9889 1.0317 1.0032 1.0087 1.0138 1.0036 1.0013 1.0004 1.0243 1.0245 1.0069 1.0030 0.9958
dispcorr: -0.020390463 hartree
energy: -1777.746660366681
dipole: -37.77254 35.14947 -2.62307 4.29506 -5.20262 -0.90756 -9.16990 8.82048 -0.34942
magnitude: 2.79755 au
magnitude: 7.11080 debye
