program: Orca
programVersion: 4.2.1
elementType: Cl Cl O O N N N C C C C C C C C C C C C C C H H H H H H H H H H H H H H H
charge: 0
multiplicity: 1
keywords: wb97x-d3
keywords: def2-TZVPP
keywords: def2/J RIJCOSX GRIDX6 NOFINALGRIDX
keywords: grid4 nofinalgrid
keywords: scfconv7
keywords: smallprint printgap noloewdin
keywords: NOSOSCF
formula: C14H15Cl2N3O2
InChI: InChI=1S/C14H15Cl2N3O2/c1-2-11-6-20-14(21-11,7-19-9-17-8-18-19)12-4-3-10(15)5-13(12)16/h3-5,8-9,11H,2,6-7H2,1H3
36 atoms
Cl 1.075586 0.084321 -2.340572
Cl 4.173606 -3.647253 -0.140268
O  -1.289665 0.255105 -0.58727
O  -1.083106 0.02063 1.625139
N  -0.80436 2.705494 0.745027
N  -1.290428 3.395672 -0.287968
N  -2.346184 3.96803 1.601023
C  -0.371092 0.302648 0.447465
C  -2.271902 -0.706069 -0.229925
C  -2.347174 -0.530655 1.282817
C  0.218958 1.710771 0.574857
C  0.762771 -0.706889 0.262516
C  -3.559933 -0.461587 -0.992047
C  -4.083718 0.965938 -0.93711
C  1.456027 -0.857031 -0.938483
C  1.17322 -1.492257 1.335797
C  2.500666 -1.760043 -1.071289
C  2.21491 -2.39841 1.232112
C  -1.446279 3.052177 1.864271
C  2.869933 -2.525456 0.020381
C  -2.208842 4.140382 0.270692
H  -1.906967 -1.715315 -0.464272
H  -3.138306 0.159276 1.58997
H  -2.49846 -1.479615 1.800364
H  0.804493 1.975188 -0.302775
H  0.887253 1.735237 1.435602
H  -4.306111 -1.15416 -0.592155
H  -3.411087 -0.75541 -2.033928
H  -4.255051 1.310435 0.083714
H  -3.397455 1.665791 -1.41112
H  -5.037914 1.032815 -1.461036
H  0.667491 -1.397369 2.286088
H  3.018268 -1.858875 -2.015435
H  2.506918 -2.992243 2.087059
H  -1.218567 2.630679 2.830371
H  -2.799478 4.839983 -0.300257
elementType: Cl O N C H
totalener: -1777.72623390 hartree
nucrepener: 2034.29400513 hartree
electener: -3812.02023904 hartree
oneelecener: -6482.21677308 hartree
twoeener: 2670.19653405 hartree
cpcmener: -0.02329888 hartree
kineticenergy: 1772.80475606 hartree
xcener: -124.639616264998 hartree
chargesum: 0.0000000
charge: -0.071662 -0.082235 -0.352496 -0.405251 0.128784 -0.340457 -0.407927 0.575118 0.141804 -0.012040 -0.111757 -0.118581 -0.113722 -0.268966 -0.017471 -0.139773 -0.153610 -0.186231 0.054624 0.117692 0.054403 0.093152 0.092789 0.107142 0.132938 0.139996 0.071392 0.074802 0.071357 0.081344 0.100605 0.149109 0.121206 0.145044 0.168786 0.160091
qa: -0.0717 -0.0822 -0.3525 -0.4053 0.1288 -0.3405 -0.4079 0.5751 0.1418 -0.0120 -0.1118 -0.1186 -0.1137 -0.2690 -0.0175 -0.1398 -0.1536 -0.1862 0.0546 0.1177 0.0544 0.0932 0.0928 0.1071 0.1329 0.1400 0.0714 0.0748 0.0714 0.0813 0.1006 0.1491 0.1212 0.1450 0.1688 0.1601
va: 1.2473 1.2218 2.0260 1.9593 3.3880 2.8860 3.0275 3.8677 3.8826 3.9508 3.8138 3.6016 3.9242 3.9359 4.0074 3.9538 4.0833 4.0510 4.0655 3.8561 4.0383 0.9982 0.9985 1.0011 1.0314 1.0054 1.0096 1.0067 1.0076 1.0170 1.0043 1.0262 1.0265 1.0073 1.0030 0.9972
dispcorr: -0.021142200 hartree
energy: -1777.747376103470
dipole: -29.71807 29.74009 0.02202 8.31406 -10.01714 -1.70308 6.72122 -5.84047 0.88075
magnitude: 1.91747 au
magnitude: 4.87381 debye
