program: Orca
programVersion: 4.2.1
elementType: Cl Cl O O N N N C C C C C C C C C C C C C C H H H H H H H H H H H H H H H
charge: 0
multiplicity: 1
keywords: wb97x-d3
keywords: def2-TZVPP
keywords: def2/J RIJCOSX GRIDX6 NOFINALGRIDX
keywords: grid4 nofinalgrid
keywords: scfconv7
keywords: smallprint printgap noloewdin
keywords: NOSOSCF
formula: C14H15Cl2N3O2
InChI: InChI=1S/C14H15Cl2N3O2/c1-2-11-6-20-14(21-11,7-19-9-17-8-18-19)12-4-3-10(15)5-13(12)16/h3-5,8-9,11H,2,6-7H2,1H3
36 atoms
Cl 1.671822 -0.447736 2.250403
Cl 4.004126 -3.585892 -1.366611
O  -1.369265 0.291363 -0.999919
O  -1.054963 0.003774 1.184042
N  -0.871836 2.712178 0.400232
N  -1.11862 3.090188 1.657481
N  -2.589999 4.034276 0.252912
C  -0.398806 0.329171 0.00843
C  -2.448867 -0.538744 -0.577891
C  -2.025154 -0.95425 0.837643
C  0.152735 1.755684 0.095074
C  0.728735 -0.656017 -0.308055
C  -3.757647 0.227637 -0.633282
C  -4.117752 0.710367 -2.029719
C  1.677815 -1.05498 0.633067
C  0.845959 -1.180998 -1.591449
C  2.684569 -1.954217 0.312927
C  1.842295 -2.078101 -1.934969
C  -1.763844 3.281197 -0.42448
C  2.75698 -2.463846 -0.971208
C  -2.152168 3.88194 1.521868
H  -2.505901 -1.410916 -1.240422
H  -2.83732 -0.901761 1.563015
H  -1.609117 -1.968512 0.853574
H  0.615105 2.009687 -0.859809
H  0.916015 1.824058 0.867011
H  -3.715671 1.071199 0.06154
H  -4.545382 -0.437369 -0.266332
H  -4.206488 -0.123532 -2.728192
H  -5.070225 1.238389 -2.023356
H  -3.368503 1.394565 -2.425479
H  0.13295 -0.881475 -2.34645
H  3.40322 -2.25124 1.063331
H  1.902908 -2.471919 -2.939573
H  -1.764937 3.124331 -1.491348
H  -2.605155 4.375046 2.367483
totalener: -1777.70101021 hartree
nucrepener: 2028.93761765 hartree
electener: -3806.63862785 hartree
oneelecener: -6471.21008973 hartree
twoeener: 2664.57146188 hartree
kineticenergy: 1772.81814186 hartree
xcener: -124.637983825175 hartree
chargesum: -0.0000000
charge: -0.042575 -0.063461 -0.384130 -0.305094 0.129037 -0.288618 -0.333104 0.575154 0.114476 0.022284 -0.123341 -0.172442 -0.160942 -0.245603 -0.019115 -0.116051 -0.157411 -0.174664 0.000184 0.114288 0.055119 0.077187 0.091961 0.081030 0.126431 0.135760 0.085107 0.076741 0.074742 0.093651 0.079615 0.140628 0.114224 0.125732 0.143829 0.129368
qa: -0.0426 -0.0635 -0.3841 -0.3051 0.1290 -0.2886 -0.3331 0.5752 0.1145 0.0223 -0.1233 -0.1724 -0.1609 -0.2456 -0.0191 -0.1161 -0.1574 -0.1747 0.0002 0.1143 0.0551 0.0772 0.0920 0.0810 0.1264 0.1358 0.0851 0.0767 0.0747 0.0937 0.0796 0.1406 0.1142 0.1257 0.1438 0.1294
va: 1.2803 1.2422 1.9859 2.0513 3.3460 2.8761 3.0348 3.8852 3.8760 3.9629 3.7962 3.5784 3.9359 3.9408 4.0590 3.9415 4.0776 4.0670 4.0992 3.9209 4.0471 0.9990 0.9971 0.9994 1.0049 1.0352 1.0083 1.0092 1.0034 1.0074 1.0103 1.0258 1.0293 1.0147 1.0041 1.0014
dispcorr: -0.020915246 hartree
energy: -1777.721925451154
dipole: -31.41315 31.28908 -0.12407 9.92636 -11.06152 -1.13516 -9.99407 9.07329 -0.92078
magnitude: 1.46691 au
magnitude: 3.72858 debye
