program: Orca
programVersion: 4.2.1
elementType: Cl Cl O O N N N C C C C C C C C C C C C C C H H H H H H H H H H H H H H H
charge: 0
multiplicity: 1
keywords: wb97x-d3
keywords: def2-TZVPP
keywords: def2/J RIJCOSX GRIDX6 NOFINALGRIDX
keywords: grid4 nofinalgrid
keywords: scfconv7
keywords: smallprint printgap noloewdin
keywords: NOSOSCF
formula: C14H15Cl2N3O2
InChI: InChI=1S/C14H15Cl2N3O2/c1-2-11-6-20-14(21-11,7-19-9-17-8-18-19)12-4-3-10(15)5-13(12)16/h3-5,8-9,11H,2,6-7H2,1H3
36 atoms
Cl 0.501318 -1.333247 2.604769
Cl 4.058842 -1.907847 -1.316638
O  -2.087629 0.498706 -0.594993
O  -2.057207 -0.71905 1.255758
N  -0.331027 2.434898 0.670687
N  0.973451 2.564193 0.931548
N  0.374903 3.915572 -0.754148
C  -1.304006 0.189205 0.521555
C  -2.858099 -0.648488 -0.927871
C  -2.695061 -1.549637 0.312854
C  -1.130293 1.458767 1.358282
C  0.042952 -0.381823 0.083343
C  -4.28686 -0.230938 -1.22382
C  -5.121007 -1.381352 -1.769095
C  0.901372 -1.060791 0.945394
C  0.483795 -0.171953 -1.219209
C  2.132487 -1.535707 0.520283
C  1.710265 -0.63011 -1.666138
C  -0.669784 3.24373 -0.345253
C  2.527362 -1.318246 -0.787416
C  1.354165 3.461891 0.057488
H  -2.430121 -1.137386 -1.812584
H  -3.647336 -1.877194 0.733638
H  -2.092253 -2.436644 0.091765
H  -0.635371 1.228101 2.298918
H  -2.115284 1.873188 1.578578
H  -4.271529 0.584043 -1.951321
H  -4.740012 0.170395 -0.312713
H  -5.188969 -2.212622 -1.064782
H  -6.139132 -1.057957 -1.981386
H  -4.702214 -1.772259 -2.697847
H  -0.145085 0.377261 -1.905551
H  2.777507 -2.06215 1.208985
H  2.026078 -0.447589 -2.683323
H  -1.671244 3.307339 -0.740574
H  2.374742 3.806683 0.005055
totalener: -1777.70118020 hartree
nucrepener: 2048.14168097 hartree
electener: -3825.84286117 hartree
oneelecener: -6509.74875561 hartree
twoeener: 2683.90589444 hartree
kineticenergy: 1772.81314514 hartree
xcener: -124.636889441034 hartree
chargesum: 0.0000000
charge: -0.057558 -0.067821 -0.371248 -0.319402 0.106729 -0.304090 -0.328035 0.570935 0.097911 0.016323 -0.095487 -0.158298 -0.132319 -0.249306 -0.002831 -0.111370 -0.142353 -0.185457 0.036385 0.119242 0.060881 0.073172 0.087563 0.084969 0.130455 0.112377 0.070581 0.067110 0.070004 0.093061 0.079071 0.139298 0.110395 0.124438 0.143487 0.131190
qa: -0.0576 -0.0678 -0.3712 -0.3194 0.1067 -0.3041 -0.3280 0.5709 0.0979 0.0163 -0.0955 -0.1583 -0.1323 -0.2493 -0.0028 -0.1114 -0.1424 -0.1855 0.0364 0.1192 0.0609 0.0732 0.0876 0.0850 0.1305 0.1124 0.0706 0.0671 0.0700 0.0931 0.0791 0.1393 0.1104 0.1244 0.1435 0.1312
va: 1.2663 1.2375 2.0008 2.0479 3.3251 2.8539 3.0651 3.8713 3.9007 3.9365 3.8371 3.6012 3.9417 3.9385 4.0288 3.8876 4.0893 4.1136 4.0859 3.9193 4.0446 0.9987 0.9972 0.9989 1.0301 1.0222 1.0136 1.0128 1.0076 1.0061 1.0039 1.0203 1.0282 1.0139 1.0118 1.0019
dispcorr: -0.020821033 hartree
energy: -1777.722001229986
dipole: -33.89925 32.30377 -1.59548 2.90808 -3.81319 -0.90511 -10.69354 10.30100 -0.39254
magnitude: 1.87587 au
magnitude: 4.76807 debye
