program: Orca
programVersion: 4.2.1
elementType: Cl Cl O O N N N C C C C C C C C C C C C C C H H H H H H H H H H H H H H H
charge: 0
multiplicity: 1
keywords: wb97x-d3
keywords: def2-TZVPP
keywords: def2/J RIJCOSX GRIDX6 NOFINALGRIDX
keywords: grid4 nofinalgrid
keywords: scfconv7
keywords: smallprint printgap noloewdin
keywords: NOSOSCF
formula: C14H15Cl2N3O2
InChI: InChI=1S/C14H15Cl2N3O2/c1-2-11-6-20-14(21-11,7-19-9-17-8-18-19)12-4-3-10(15)5-13(12)16/h3-5,8-9,11H,2,6-7H2,1H3
36 atoms
Cl 1.233108 0.153168 -2.36473
Cl 4.044596 -3.76907 -0.113594
O  -1.204414 0.372881 -0.695133
O  -1.042996 0.144879 1.533345
N  -0.700981 2.791904 0.737289
N  -1.351375 3.416159 -0.248888
N  -2.20749 3.994771 1.74265
C  -0.308904 0.399864 0.362572
C  -2.348905 -0.358457 -0.301221
C  -2.39917 -0.07119 1.193523
C  0.30713 1.804267 0.474567
C  0.787821 -0.650944 0.212334
C  -3.552303 0.115649 -1.086878
C  -4.825512 -0.611723 -0.677004
C  1.516518 -0.819865 -0.964868
C  1.114207 -1.473886 1.285986
C  2.514899 -1.777109 -1.07057
C  2.108363 -2.433183 1.205201
C  -1.231105 3.143384 1.919353
C  2.803194 -2.580322 0.017952
C  -2.240444 4.127648 0.398408
H  -2.188557 -1.433667 -0.474443
H  -2.997386 0.822163 1.412419
H  -2.789353 -0.904205 1.780365
H  0.828617 2.076558 -0.440538
H  1.029538 1.809281 1.292265
H  -3.362908 -0.041015 -2.150809
H  -3.662068 1.193796 -0.944781
H  -5.089109 -0.423034 0.365139
H  -5.669227 -0.285664 -1.283456
H  -4.731487 -1.691432 -0.803946
H  0.571081 -1.365851 2.213497
H  3.059802 -1.890458 -1.996765
H  2.335883 -3.059173 2.056164
H  -0.872117 2.762987 2.86284
H  -2.934458 4.77395 -0.115709
totalener: -1777.70158060 hartree
nucrepener: 2019.58390123 hartree
electener: -3797.28548183 hartree
oneelecener: -6452.55271910 hartree
twoeener: 2655.26723728 hartree
kineticenergy: 1772.81043145 hartree
xcener: -124.637383970254 hartree
chargesum: -0.0000000
charge: -0.049299 -0.065315 -0.324890 -0.388605 0.124971 -0.305753 -0.329703 0.543637 0.154942 -0.030446 -0.130129 -0.096709 -0.117559 -0.260110 -0.015885 -0.133766 -0.154920 -0.157125 0.021228 0.107654 0.049505 0.072406 0.087952 0.101546 0.133922 0.120566 0.075019 0.066747 0.077225 0.094453 0.080008 0.135962 0.113690 0.124403 0.142425 0.131954
qa: -0.0493 -0.0653 -0.3249 -0.3886 0.1250 -0.3058 -0.3297 0.5436 0.1549 -0.0304 -0.1301 -0.0967 -0.1176 -0.2601 -0.0159 -0.1338 -0.1549 -0.1571 0.0212 0.1077 0.0495 0.0724 0.0880 0.1015 0.1339 0.1206 0.0750 0.0667 0.0772 0.0945 0.0800 0.1360 0.1137 0.1244 0.1424 0.1320
va: 1.2725 1.2400 2.0507 1.9781 3.3531 2.8630 3.0492 3.8886 3.8692 3.9651 3.8344 3.6233 3.9406 3.9356 4.0453 3.9570 4.0802 4.0495 4.0736 3.9232 4.0336 1.0055 0.9920 0.9979 1.0344 1.0061 1.0126 1.0190 1.0028 1.0067 1.0030 1.0313 1.0288 1.0145 1.0094 1.0017
dispcorr: -0.020248980 hartree
energy: -1777.721829576343
dipole: -31.82545 31.68610 -0.13935 6.72903 -7.79669 -1.06766 7.02029 -6.59629 0.42400
magnitude: 1.15719 au
magnitude: 2.94134 debye
