program: Orca
programVersion: 4.2.1
elementType: Cl Cl O O N N N C C C C C C C C C C C C C C H H H H H H H H H H H H H H H
charge: 0
multiplicity: 1
keywords: wb97x-d3
keywords: def2-TZVPP
keywords: def2/J RIJCOSX GRIDX6 NOFINALGRIDX
keywords: grid4 nofinalgrid
keywords: scfconv7
keywords: smallprint printgap noloewdin
keywords: NOSOSCF
formula: C14H15Cl2N3O2
InChI: InChI=1S/C14H15Cl2N3O2/c1-2-11-6-20-14(21-11,7-19-9-17-8-18-19)12-4-3-10(15)5-13(12)16/h3-5,8-9,11H,2,6-7H2,1H3
36 atoms
Cl 1.148147 0.369406 -2.208778
Cl 4.157601 -3.663812 -0.46368
O  -1.265677 0.277245 -0.507384
O  -1.084209 -0.210347 1.670946
N  -0.84633 2.609825 0.909699
N  -1.556301 2.80751 2.023722
N  -2.342742 4.084137 0.354728
C  -0.366378 0.221716 0.549036
C  -2.258581 -0.702659 -0.255843
C  -2.366662 -0.642438 1.264592
C  0.191996 1.624278 0.829167
C  0.780317 -0.748502 0.263799
C  -3.521736 -0.408855 -1.04274
C  -4.119211 0.976524 -0.841417
C  1.49495 -0.749443 -0.933633
C  1.163618 -1.670435 1.232918
C  2.530407 -1.642633 -1.164017
C  2.196581 -2.568813 1.028789
C  -1.335437 3.372413 -0.078357
C  2.872472 -2.551117 -0.178129
C  -2.438073 3.69993 1.645703
H  -1.881066 -1.691627 -0.555132
H  -3.120095 0.072985 1.605965
H  -2.58786 -1.618455 1.701616
H  0.885759 1.921999 0.044153
H  0.739141 1.606622 1.770653
H  -4.252506 -1.177473 -0.774347
H  -3.3077 -0.563568 -2.1028
H  -4.371724 1.177742 0.199422
H  -3.442435 1.762274 -1.168463
H  -5.038082 1.074156 -1.418553
H  0.634719 -1.688072 2.174961
H  3.061464 -1.626086 -2.105001
H  2.46857 -3.275023 1.80036
H  -0.927547 3.371829 -1.077333
H  -3.173096 4.096515 2.328568
totalener: -1777.70046223 hartree
nucrepener: 2038.66732952 hartree
electener: -3816.36779175 hartree
oneelecener: -6490.71990440 hartree
twoeener: 2674.35211264 hartree
kineticenergy: 1772.81523451 hartree
xcener: -124.640270740561 hartree
chargesum: -0.0000000
charge: -0.061789 -0.064226 -0.350571 -0.348400 0.139790 -0.309181 -0.333418 0.565372 0.122164 -0.004977 -0.133821 -0.131394 -0.112453 -0.262026 -0.025038 -0.117010 -0.155256 -0.164048 0.017950 0.109001 0.054856 0.081875 0.083996 0.087755 0.130882 0.122840 0.060328 0.075059 0.067873 0.103052 0.096100 0.141587 0.114533 0.125127 0.143111 0.130356
qa: -0.0618 -0.0642 -0.3506 -0.3484 0.1398 -0.3092 -0.3334 0.5654 0.1222 -0.0050 -0.1338 -0.1314 -0.1125 -0.2620 -0.0250 -0.1170 -0.1553 -0.1640 0.0179 0.1090 0.0549 0.0819 0.0840 0.0878 0.1309 0.1228 0.0603 0.0751 0.0679 0.1031 0.0961 0.1416 0.1145 0.1251 0.1431 0.1304
va: 1.2593 1.2414 2.0192 2.0206 3.3266 2.8726 3.0304 3.8605 3.9083 3.9924 3.8282 3.6132 3.9265 3.9444 4.0247 3.9519 4.0823 4.0525 4.0787 3.9244 4.0360 0.9975 1.0032 0.9984 1.0164 1.0247 1.0088 1.0075 1.0119 1.0065 1.0066 1.0294 1.0277 1.0147 1.0063 1.0023
dispcorr: -0.021375597 hartree
energy: -1777.721837830097
dipole: -29.89997 29.91542 0.01545 7.72926 -8.87537 -1.14611 5.88837 -5.98797 -0.09960
magnitude: 1.15053 au
magnitude: 2.92442 debye
